{"text_format":"1","workbook":"xlsx","n_sheets":8,"sheets":["Orçamento","Resumo ","Somatório","Cronog_90_Dias","Composição BDI","Relatório CENTRAL","Parc Maior Relev","Composições"],"not_rendered":{"charts":0,"images":6,"macros":1,"external_links":2,"defined_names":151,"comments":2,"pivot_tables":0},"unopened":[],"bounds":{"document_bytes":16777216,"sheet_cells":100000,"rows_first":2000,"rows_last":500,"rows_between":2000,"halvings":0,"cell_chars":16384,"cell_head_chars":4096},"cells_cut":0,"cells_raw":0,"read":"whole","date_system":"1900"}

{"sheet":"Orçamento","index":0,"n_rows":409,"n_cols":34,"rows_kept":409,"cut":false,"hidden":false,"merged":[[344,16,344,22],[9,12,10,12],[379,18,379,20],[379,21,379,22],[1,14,1,22],[9,14,9,16],[10,14,10,16],[12,14,12,16],[13,14,13,16],[15,14,15,22],[2,14,2,22],[5,14,5,22],[8,14,8,22],[363,18,363,20],[363,21,363,22],[371,21,371,22],[360,15,360,17],[361,15,361,17],[362,15,362,17],[364,21,364,22],[372,18,372,20],[372,21,372,22],[370,18,370,20],[370,21,370,22],[378,18,378,20],[378,21,378,22],[365,18,365,20],[365,21,365,22],[358,18,358,20],[358,21,358,22],[380,18,380,20],[380,21,380,22],[334,20,334,21],[356,18,356,20],[356,21,356,22],[357,18,357,20],[357,21,357,22],[355,18,355,20],[355,21,355,22],[364,18,364,20],[335,20,335,21],[346,18,346,22],[352,18,352,20],[352,21,352,22],[353,18,353,20],[353,21,353,22],[354,18,354,20],[354,21,354,22],[377,18,377,20],[377,21,377,22],[374,21,374,22],[375,18,375,20],[375,21,375,22],[376,18,376,20],[376,21,376,22],[366,18,366,20],[366,21,366,22],[373,18,373,20],[373,21,373,22],[368,21,368,22],[369,18,369,20],[369,21,369,22],[371,18,371,20],[367,18,367,20],[367,21,367,22],[368,18,368,20],[372,15,372,17],[373,15,373,17],[374,15,374,17],[375,15,375,17],[376,15,376,17],[349,14,349,23],[338,20,338,21],[337,20,337,21],[333,17,338,17],[333,20,333,21],[350,18,350,20],[350,21,350,22],[351,18,351,20],[351,21,351,22],[339,20,339,21],[359,18,359,20],[359,21,359,22],[360,18,360,20],[360,21,360,22],[361,18,361,20],[361,21,361,22],[362,18,362,20],[362,21,362,22],[374,18,374,20],[351,15,351,17],[352,15,352,17],[353,15,353,17],[354,15,354,17],[355,15,355,17],[356,15,356,17],[357,15,357,17],[358,15,358,17],[359,15,359,17],[363,15,363,17],[364,15,364,17],[365,15,365,17],[366,15,366,17],[367,15,367,17],[368,15,368,17],[369,15,369,17],[370,15,370,17],[371,15,371,17],[0,14,0,23],[341,16,341,22],[342,16,342,22],[343,16,343,22],[4,21,4,22],[3,21,3,22],[6,21,6,22],[11,14,11,23],[14,14,14,23],[7,21,7,22],[3,14,3,20],[4,14,4,20],[6,18,6,20],[7,18,7,20],[7,14,7,17],[6,14,6,17],[13,21,13,22],[13,18,13,20],[9,18,9,20],[9,21,9,22],[10,19,10,20],[383,14,383,23],[384,18,384,20],[384,21,384,22],[385,15,385,17],[385,18,385,20],[385,21,385,22],[386,15,386,17],[386,18,386,20],[386,21,386,22],[408,18,408,20],[408,21,408,22],[405,14,405,17],[402,15,402,17],[402,18,402,20],[402,21,402,22],[403,15,403,17],[403,18,403,20],[403,21,403,22],[404,15,404,17],[404,18,404,20],[404,21,404,22],[407,18,407,20],[407,21,407,22],[406,18,406,20],[406,21,406,22],[19,32,19,33],[377,14,377,17],[384,15,384,17],[350,15,350,17],[405,18,405,20],[405,21,405,22],[393,15,393,17],[393,18,393,20],[393,21,393,22],[394,15,394,17],[394,18,394,20],[394,21,394,22],[395,15,395,17],[395,18,395,20],[395,21,395,22],[399,15,399,17],[399,18,399,20],[399,21,399,22],[400,15,400,17],[400,18,400,20],[400,21,400,22],[401,15,401,17],[390,15,390,17],[345,16,345,22],[401,18,401,20],[401,21,401,22],[396,15,396,17],[396,18,396,20],[396,21,396,22],[397,15,397,17],[397,18,397,20],[397,21,397,22],[398,15,398,17],[398,18,398,20],[398,21,398,22],[390,18,390,20],[390,21,390,22],[391,15,391,17],[391,18,391,20],[391,21,391,22],[392,15,392,17],[392,18,392,20],[392,21,392,22],[387,15,387,17],[387,18,387,20],[387,21,387,22],[388,15,388,17],[388,18,388,20],[388,21,388,22],[389,15,389,17],[389,18,389,20],[389,21,389,22]]}
[null,null,null,null,null,null,null,null,null,null,null,null,null,null,"ORÇAMENTO PADRÃO v3.2.10.1"]
[]
[]
[null,null,null,null,null,null,null,null,null,null,null,null,null,null,"UNIDADE ESCOLAR",null,null,null,null,null,null,"CÓDIGO INEP"]
[null,null,null,null,null,null,null,null,null,null,null,null,null,null,"COLÉGIO ESTADUAL DA POLÍCIA MILITAR DE GOIÁS DE FORMOSA - DOMINGOS DE OLIVEIRA",null,null,null,null,null,null,52046273]
[null,null,null,null,null,null,null,null,null,null,null,null,null,null,null,null,null,null,null,null,null,null,null,null,"DESONERADA","ONERADA","Δ%"]
["Nmax",null,null,null,null,null,null,null,null,null,null,null,"Ajustar altura?",null,"OBRA",null,null,null,"DATA",null,null,"CIDADE",null,null,277978.27,277257.65000000002,{"$f":"IFERROR(IF(Y7>Z7,ABS(Y7-Z7)/Y7,ABS(Z7-Y7)/Z7),\"-\")","v":2.5923609064837884E-3},{"$f":"IF(AA7>5%,\"Atentar quanto ao total para tabelas 'ONERADA' e 'DESONERADA'\",\"\")","v":""}]
[{"$f":"MAX($C$19:$C$333)","v":3},null,null,null,null,null,null,null,null,null,null,null,"SIM",null,"REFORMA E AMPLIAÇÃO",null,null,null,"2020-04-02",null,null,"FORMOSA"]
[]
[null,null,null,null,null,null,null,null,null,null,null,null,{"$f":"IF($M$8=\"MANUAL\",\"DESPROTEJA A PLANILHA PARA FORMATAR\",\"\")","v":""},null,"CRE",null,null,"ENDEREÇO","REFERÊNCIA AGETOP",null,null,"REFERÊNCIA SINAPI"]
[null,null,null,null,null,null,null,null,null,null,null,null,null,null,"FORMOSA",null,null,"Avenida Santa Bárbara S/Nº, Loteamento Santa Bárbara, CEP:73803-155","ABR/19","ONERADA",null,"DEZ/19","ONERADA"]
[]
[null,null,null,null,null,null,null,null,null,null,null,null,null,null,"ÁREA EXISTENTE (M²)",null,null,"ÁREA A CONSTRUIR (M²)","ÁREA A DEMOLIR (M²)",null,null,"ÁREA TOTAL CONSTRUÍDA (M²)"]
[null,null,null,null,null,null,null,null,null,null,null,null,null,null,2597.79,null,null,48.51,0,null,null,2646.3]
[]
[null,null,null,null,null,null,null,null,null,null,null,"FILTRO",null,null,"PLANILHA ORÇAMENTÁRIA"]
["Nível E","Save Nivel","Nível C","Altura","n1","n2","n3","n4","n5","Czero","Cnível","↓","Nível","Nível Corrigido","ITEM","TABELA","CODIGO","DESCRIÇÃO DOS SERVIÇOS","UNID","QUANT","MAT","MO","T.SERVIÇO","OBSERVAÇÕES¹","TROCAR PREÇO?","FONTE","CÓDIGO","DESCRIÇÃO DO SERVIÇO","UNID","MAT","MO"]
[{"$f":"CHOOSE(1+LOG(1+2*(ORÇAMENTO.Nivel=\"Nível 1\")+4*(ORÇAMENTO.Nivel=\"Nível 2\")+8*(ORÇAMENTO.Nivel=\"Nível 3\")+16*(ORÇAMENTO.Nivel=\"Nível 4\")+32*(ORÇAMENTO.Nivel=\"Serviço\"),2),0,1,2,3,4,\"S\")","v":"S"},{"$f":"IF(OR(C18=\"s\",C18=0),OFFSET(B18,-1,0),C18)","v":"Save Nivel"},{"$f":"IF(OFFSET(C18,-1,0)=\"L\",1,IF(OFFSET(C18,-1,0)=1,2,IF(OR(A18=\"s\",A18=0),\"S\",IF(AND(OFFSET(C18,-1,0)=2,A18=4),3,IF(AND(OR(OFFSET(C18,-1,0)=\"s\",OFFSET(C18,-1,0)=0),A18<>\"s\",A18>OFFSET(B18,-1,0)),OFFSET(B18,-1,0),A18)))))","v":"S"},{"$f":"IF(OR(C18=\"S\",C18=0),0,IF(ISERROR(K18),J18,SMALL(J18:K18,1)))","v":0},{"$f":"IF($C18=1,OFFSET(E18,-1,0)+1,OFFSET(E18,-1,0))","v":"n1"},{"$f":"IF($C18=1,0,IF($C18=2,OFFSET(F18,-1,0)+1,OFFSET(F18,-1,0)))","v":"n2"},{"$f":"IF(AND($C18<=2,$C18<>0),0,IF($C18=3,OFFSET(G18,-1,0)+1,OFFSET(G18,-1,0)))","v":"n3"},{"$f":"IF(AND($C18<=3,$C18<>0),0,IF($C18=4,OFFSET(H18,-1,0)+1,OFFSET(H18,-1,0)))","v":"n4"},{"$f":"IF(AND($C18<=4,$C18<>0),0,IF(AND($C18=\"S\",$W18>0),OFFSET(I18,-1,0)+1,OFFSET(I18,-1,0)))","v":"n5"},{"$f":"IF(OR($C18=\"S\",$C18=0),0,MATCH(0,OFFSET($D18,1,$C18,ROW($C$333)-ROW($C18)),0))","v":0},{"$f":"IF(OR($C18=\"S\",$C18=0),0,MATCH(OFFSET($D18,0,$C18)+1,OFFSET($D18,1,$C18,ROW($C$333)-ROW($C18)),0))","v":0},{"$f":"IF(OR(W18>0,$C18=1),\"F\",\"\")","v":""},"Serviço",{"$f":"CHOOSE(1+LOG(1+2*(C18=1)+4*(C18=2)+8*(C18=3)+16*(C18=4)+32*(C18=\"S\"),2),\"\",\"Nível 1\",\"Nível 2\",\"Nível 3\",\"Nível 4\",\"Serviço\")","v":"Serviço"},"-","SINAPI",null,"(sem código)","-",null,0,0,0,"",null,{"$f":"IFERROR(VLOOKUP(Q18,INDIRECT(\"EQUIVALÊNCIAS\"),4,FALSE),\"\")","v":""},{"$f":"IFERROR(VLOOKUP(Q18,INDIRECT(\"EQUIVALÊNCIAS\"),5,FALSE),\"\")","v":""},{"$f":"IFERROR(IF(OR($C18=0,$C18=1,$C18=2,$C18=3,$C18=4),R18,VLOOKUP($AA18,INDIRECT($Z18),2,FALSE)),\"(sem código)\")","v":"(sem código)"},{"$f":"IFERROR(VLOOKUP(AA18,INDIRECT(Z18),3,FALSE()),\"-\")","v":"-"},{"$f":"IFERROR(VLOOKUP($AA18,INDIRECT($Z18),IF($T$11=\"DESONERADA\",4,7),FALSE()),0)","v":0},{"$f":"IFERROR(VLOOKUP($AA18,INDIRECT($Z18),IF($T$11=\"DESONERADA\",5,8),FALSE()),0)","v":0}]
[0,null,"L",{"$f":"COUNTA(OFFSET(D19,1,0):D$333)","v":313},{"$f":"LEFT(O20,1)-1","v":0},null,null,null,null,null,null,"F","LOTE","LOTE","REFORMA E AMPLIAÇÃO - COLÉGIO ESTADUAL DA POLÍCIA MILITAR DE GOIÁS DE FORMOSA - DOMINGOS DE OLIVEIRA",null,null,null,null,null,null,null,230386.70999999996,null,{"$f":"O19","v":"REFORMA E AMPLIAÇÃO - COLÉGIO ESTADUAL DA POLÍCIA MILITAR DE GOIÁS DE FORMOSA - DOMINGOS DE OLIVEIRA"}]
[{"$f":"CHOOSE(1+LOG(1+2*(ORÇAMENTO.Nivel=\"Nível 1\")+4*(ORÇAMENTO.Nivel=\"Nível 2\")+8*(ORÇAMENTO.Nivel=\"Nível 3\")+16*(ORÇAMENTO.Nivel=\"Nível 4\")+32*(ORÇAMENTO.Nivel=\"Serviço\"),2),0,1,2,3,4,\"S\")","v":1},{"$f":"IF(OR(C20=\"s\",C20=0),OFFSET(B20,-1,0),C20)","v":1},{"$f":"IF(OFFSET(C20,-1,0)=\"L\",1,IF(OFFSET(C20,-1,0)=1,2,IF(OR(A20=\"s\",A20=0),\"S\",IF(AND(OFFSET(C20,-1,0)=2,A20=4),3,IF(AND(OR(OFFSET(C20,-1,0)=\"s\",OFFSET(C20,-1,0)=0),A20<>\"s\",A20>OFFSET(B20,-1,0)),OFFSET(B20,-1,0),A20)))))","v":1},{"$f":"IF(OR(C20=\"S\",C20=0),0,IF(ISERROR(K20),J20,SMALL(J20:K20,1)))","v":170},{"$f":"IF($C20=1,OFFSET(E20,-1,0)+1,OFFSET(E20,-1,0))","v":1},{"$f":"IF($C20=1,0,IF($C20=2,OFFSET(F20,-1,0)+1,OFFSET(F20,-1,0)))","v":0},{"$f":"IF(AND($C20<=2,$C20<>0),0,IF($C20=3,OFFSET(G20,-1,0)+1,OFFSET(G20,-1,0)))","v":0},{"$f":"IF(AND($C20<=3,$C20<>0),0,IF($C20=4,OFFSET(H20,-1,0)+1,OFFSET(H20,-1,0)))","v":0},{"$f":"IF(AND($C20<=4,$C20<>0),0,IF(AND($C20=\"S\",$W20>0),OFFSET(I20,-1,0)+1,OFFSET(I20,-1,0)))","v":0},{"$f":"IF(OR($C20=\"S\",$C20=0),0,MATCH(0,OFFSET($D20,1,$C20,ROW($C$333)-ROW($C20)),0))","v":313},{"$f":"IF(OR($C20=\"S\",$C20=0),0,MATCH(OFFSET($D20,0,$C20)+1,OFFSET($D20,1,$C20,ROW($C$333)-ROW($C20)),0))","v":170},{"$f":"IF(OR(W20>0,$C20=1),\"F\",\"\")","v":"F"},"Nível 1",{"$f":"CHOOSE(1+LOG(1+2*(C20=1)+4*(C20=2)+8*(C20=3)+16*(C20=4)+32*(C20=\"S\"),2),\"\",\"Nível 1\",\"Nível 2\",\"Nível 3\",\"Nível 4\",\"Serviço\")","v":"Nível 1"},"1.","AGETOP",null,"REFORMA",null,null,null,null,169788.31999999998,null,null,null,null,{"$f":"IFERROR(IF(OR($C20=0,$C20=1,$C20=2,$C20=3,$C20=4),R20,VLOOKUP($AA20,INDIRECT($Z20),2,FALSE)),\"(sem código)\")","v":"REFORMA"},{"$f":"IFERROR(VLOOKUP(AA20,INDIRECT(Z20),3,FALSE()),\"-\")","v":"-"},{"$f":"IFERROR(VLOOKUP($AA20,INDIRECT($Z20),IF($T$11=\"DESONERADA\",4,7),FALSE()),0)","v":0},{"$f":"IFERROR(VLOOKUP($AA20,INDIRECT($Z20),IF($T$11=\"DESONERADA\",5,8),FALSE()),0)","v":0},null,"RESPOSTA"]
[2,{"$f":"IF(OR(C21=\"s\",C21=0),OFFSET(B21,-1,0),C21)","v":2},{"$f":"IF(OFFSET(C21,-1,0)=\"L\",1,IF(OFFSET(C21,-1,0)=1,2,IF(OR(A21=\"s\",A21=0),\"S\",IF(AND(OFFSET(C21,-1,0)=2,A21=4),3,IF(AND(OR(OFFSET(C21,-1,0)=\"s\",OFFSET(C21,-1,0)=0),A21<>\"s\",A21>OFFSET(B21,-1,0)),OFFSET(B21,-1,0),A21)))))","v":2},{"$f":"IF(OR(C21=\"S\",C21=0),0,IF(ISERROR(K21),J21,SMALL(J21:K21,1)))","v":14},{"$f":"IF($C21=1,OFFSET(E21,-1,0)+1,OFFSET(E21,-1,0))","v":1},{"$f":"IF($C21=1,0,IF($C21=2,OFFSET(F21,-1,0)+1,OFFSET(F21,-1,0)))","v":1},{"$f":"IF(AND($C21<=2,$C21<>0),0,IF($C21=3,OFFSET(G21,-1,0)+1,OFFSET(G21,-1,0)))","v":0},{"$f":"IF(AND($C21<=3,$C21<>0),0,IF($C21=4,OFFSET(H21,-1,0)+1,OFFSET(H21,-1,0)))","v":0},{"$f":"IF(AND($C21<=4,$C21<>0),0,IF(AND($C21=\"S\",$W21>0),OFFSET(I21,-1,0)+1,OFFSET(I21,-1,0)))","v":0},169,14,{"$f":"IF(OR(W21>0,$C21=1),\"F\",\"\")","v":""},"Nível 2",{"$f":"CHOOSE(1+LOG(1+2*(C21=1)+4*(C21=2)+8*(C21=3)+16*(C21=4)+32*(C21=\"S\"),2),\"\",\"Nível 1\",\"Nível 2\",\"Nível 3\",\"Nível 4\",\"Serviço\")","v":"Nível 2"},"1.1.","AGETOP",null,"SERVIÇOS PRELIMINARES",null,null,null,null,null,null,null,"","",{"$f":"IFERROR(IF(OR($C21=0,$C21=1,$C21=2,$C21=3,$C21=4),R21,VLOOKUP($AA21,INDIRECT($Z21),2,FALSE)),\"(sem código)\")","v":"SERVIÇOS PRELIMINARES"},{"$f":"IFERROR(VLOOKUP(AA21,INDIRECT(Z21),3,FALSE()),\"-\")","v":"-"},0,0,null,"SIM","NÃO"]
[3,{"$f":"IF(OR(C22=\"s\",C22=0),OFFSET(B22,-1,0),C22)","v":3},{"$f":"IF(OFFSET(C22,-1,0)=\"L\",1,IF(OFFSET(C22,-1,0)=1,2,IF(OR(A22=\"s\",A22=0),\"S\",IF(AND(OFFSET(C22,-1,0)=2,A22=4),3,IF(AND(OR(OFFSET(C22,-1,0)=\"s\",OFFSET(C22,-1,0)=0),A22<>\"s\",A22>OFFSET(B22,-1,0)),OFFSET(B22,-1,0),A22)))))","v":3},{"$f":"IF(OR(C22=\"S\",C22=0),0,IF(ISERROR(K22),J22,SMALL(J22:K22,1)))","v":2},{"$f":"IF($C22=1,OFFSET(E22,-1,0)+1,OFFSET(E22,-1,0))","v":1},{"$f":"IF($C22=1,0,IF($C22=2,OFFSET(F22,-1,0)+1,OFFSET(F22,-1,0)))","v":1},{"$f":"IF(AND($C22<=2,$C22<>0),0,IF($C22=3,OFFSET(G22,-1,0)+1,OFFSET(G22,-1,0)))","v":1},{"$f":"IF(AND($C22<=3,$C22<>0),0,IF($C22=4,OFFSET(H22,-1,0)+1,OFFSET(H22,-1,0)))","v":0},{"$f":"IF(AND($C22<=4,$C22<>0),0,IF(AND($C22=\"S\",$W22>0),OFFSET(I22,-1,0)+1,OFFSET(I22,-1,0)))","v":0},13,2,{"$f":"IF(OR(W22>0,$C22=1),\"F\",\"\")","v":""},"Nível 3",{"$f":"CHOOSE(1+LOG(1+2*(C22=1)+4*(C22=2)+8*(C22=3)+16*(C22=4)+32*(C22=\"S\"),2),\"\",\"Nível 1\",\"Nível 2\",\"Nível 3\",\"Nível 4\",\"Serviço\")","v":"Nível 3"},"1.1.1.","SINAPI",null,"WC ACESSÍVEL","-",null,null,null,null,"",null,{"$f":"IFERROR(VLOOKUP(Q22,INDIRECT(\"EQUIVALÊNCIAS\"),4,FALSE),\"\")","v":""},{"$f":"IFERROR(VLOOKUP(Q22,INDIRECT(\"EQUIVALÊNCIAS\"),5,FALSE),\"\")","v":""},{"$f":"IFERROR(IF(OR($C22=0,$C22=1,$C22=2,$C22=3,$C22=4),R22,VLOOKUP($AA22,INDIRECT($Z22),2,FALSE)),\"(sem código)\")","v":"WC ACESSÍVEL"},{"$f":"IFERROR(VLOOKUP(AA22,INDIRECT(Z22),3,FALSE()),\"-\")","v":"-"},0,0]
["S",3,"S",0,1,1,1,0,0,0,0,"","Serviço","Serviço","1.1.1.1.","SINAPI",97644,"REMOÇÃO DE PORTAS, DE FORMA MANUAL, SEM REAPROVEITAMENTO. AF_12/2017","M2",3.78,null,null,null,"Referência: AGETOP - 20106","SIM","","","(sem código)","-",0,0]
[3,{"$f":"IF(OR(C24=\"s\",C24=0),OFFSET(B24,-1,0),C24)","v":3},{"$f":"IF(OFFSET(C24,-1,0)=\"L\",1,IF(OFFSET(C24,-1,0)=1,2,IF(OR(A24=\"s\",A24=0),\"S\",IF(AND(OFFSET(C24,-1,0)=2,A24=4),3,IF(AND(OR(OFFSET(C24,-1,0)=\"s\",OFFSET(C24,-1,0)=0),A24<>\"s\",A24>OFFSET(B24,-1,0)),OFFSET(B24,-1,0),A24)))))","v":3},{"$f":"IF(OR(C24=\"S\",C24=0),0,IF(ISERROR(K24),J24,SMALL(J24:K24,1)))","v":2},{"$f":"IF($C24=1,OFFSET(E24,-1,0)+1,OFFSET(E24,-1,0))","v":1},{"$f":"IF($C24=1,0,IF($C24=2,OFFSET(F24,-1,0)+1,OFFSET(F24,-1,0)))","v":1},{"$f":"IF(AND($C24<=2,$C24<>0),0,IF($C24=3,OFFSET(G24,-1,0)+1,OFFSET(G24,-1,0)))","v":2},{"$f":"IF(AND($C24<=3,$C24<>0),0,IF($C24=4,OFFSET(H24,-1,0)+1,OFFSET(H24,-1,0)))","v":0},{"$f":"IF(AND($C24<=4,$C24<>0),0,IF(AND($C24=\"S\",$W24>0),OFFSET(I24,-1,0)+1,OFFSET(I24,-1,0)))","v":0},11,2,{"$f":"IF(OR(W24>0,$C24=1),\"F\",\"\")","v":""},"Nível 3",{"$f":"CHOOSE(1+LOG(1+2*(C24=1)+4*(C24=2)+8*(C24=3)+16*(C24=4)+32*(C24=\"S\"),2),\"\",\"Nível 1\",\"Nível 2\",\"Nível 3\",\"Nível 4\",\"Serviço\")","v":"Nível 3"},"1.1.2.","SINAPI",null,"ACESSIBILIDADE","-",null,null,null,null,"",null,{"$f":"IFERROR(VLOOKUP(Q24,INDIRECT(\"EQUIVALÊNCIAS\"),4,FALSE),\"\")","v":""},{"$f":"IFERROR(VLOOKUP(Q24,INDIRECT(\"EQUIVALÊNCIAS\"),5,FALSE),\"\")","v":""},{"$f":"IFERROR(IF(OR($C24=0,$C24=1,$C24=2,$C24=3,$C24=4),R24,VLOOKUP($AA24,INDIRECT($Z24),2,FALSE)),\"(sem código)\")","v":"ACESSIBILIDADE"},{"$f":"IFERROR(VLOOKUP(AA24,INDIRECT(Z24),3,FALSE()),\"-\")","v":"-"},{"$f":"IFERROR(VLOOKUP($AA24,INDIRECT($Z24),IF($T$11=\"DESONERADA\",4,7),FALSE()),0)","v":0},{"$f":"IFERROR(VLOOKUP($AA24,INDIRECT($Z24),IF($T$11=\"DESONERADA\",5,8),FALSE()),0)","v":0}]
["S",3,"S",0,1,1,2,0,0,0,0,"","Serviço","Serviço","1.1.2.1.","AGETOP",20121,"DEM. MANUAL EM CONCR.SIMPLES C/TR.ATE CB.E CARGA (O.C.)","m3    ",7.0665000000000013,null,null,null,"",null,"","","(sem código)","-",0,0]
[3,3,3,3,1,1,3,0,0,9,3,"","Nível 3","Nível 3","1.1.3.","SINAPI",null,"INST. DE INCÊNDIO","-",null,null,null,null,"",null,"","","INST. DE INCÊNDIO","-",0,0]
["S",3,"S",0,1,1,3,0,0,0,0,"","Serviço","Serviço","1.1.3.1.","AGETOP",20121,"DEM. MANUAL EM CONCR.SIMPLES C/TR.ATE CB.E CARGA (O.C.)","m3    ",3.08,null,null,null,"",null,"","","(sem código)","-",0,0]
["S",3,"S",0,1,1,3,0,0,0,0,"","Serviço","Serviço","1.1.3.2.","AGETOP",20109,"DEM.PISO CIMENT.SOBRE LASTRO CONC.C/TR.ATE CB. E CARGA","m2    ",4.8,null,null,null,"",null,"","","(sem código)","-",0,0]
[3,3,3,2,1,1,4,0,0,6,2,"","Nível 3","Nível 3","1.1.4.","SINAPI",null,"CENTRAL DE GÁS","-",null,null,null,null,"",null,"","","CENTRAL DE GÁS","-",0,0]
["S",3,"S",0,1,1,4,0,0,0,0,"","Serviço","Serviço","1.1.4.1.","AGETOP",20121,"DEM. MANUAL EM CONCR.SIMPLES C/TR.ATE CB.E CARGA (O.C.)","m3    ",0.01,null,null,null,"",null,"","","(sem código)","-",0,0]
[3,3,3,2,1,1,5,0,0,4,2,"","Nível 3","Nível 3","1.1.5.","SINAPI",null,"INST. HIDROSSANITÁRIAS","-",null,null,null,null,"",null,"","","INST. HIDROSSANITÁRIAS","-",0,0]
["S",3,"S",0,1,1,5,0,0,0,0,"","Serviço","Serviço","1.1.5.1.","AGETOP",20121,"DEM. MANUAL EM CONCR.SIMPLES C/TR.ATE CB.E CARGA (O.C.)","m3    ",0.53,null,null,null,"",null,"","","(sem código)","-",0,0]
[3,3,3,2,1,1,6,0,0,2,{"$error":"#N/A"},"","Nível 3","Nível 3","1.1.6.","SINAPI",null,"OUTROS","-",null,null,null,null,"",null,"","","OUTROS","-",0,0]
["S",3,"S",0,1,1,6,0,0,0,0,"","Serviço","Serviço","1.1.6.1.","SINAPI","74209/1","PLACA DE OBRA EM CHAPA DE ACO GALVANIZADO","M2",7.5,null,null,null,"Referência: AGETOP - 21301","SIM","","","(sem código)","-",0,0]
[2,{"$f":"IF(OR(C35=\"s\",C35=0),OFFSET(B35,-1,0),C35)","v":2},{"$f":"IF(OFFSET(C35,-1,0)=\"L\",1,IF(OFFSET(C35,-1,0)=1,2,IF(OR(A35=\"s\",A35=0),\"S\",IF(AND(OFFSET(C35,-1,0)=2,A35=4),3,IF(AND(OR(OFFSET(C35,-1,0)=\"s\",OFFSET(C35,-1,0)=0),A35<>\"s\",A35>OFFSET(B35,-1,0)),OFFSET(B35,-1,0),A35)))))","v":2},{"$f":"IF(OR(C35=\"S\",C35=0),0,IF(ISERROR(K35),J35,SMALL(J35:K35,1)))","v":3},{"$f":"IF($C35=1,OFFSET(E35,-1,0)+1,OFFSET(E35,-1,0))","v":1},{"$f":"IF($C35=1,0,IF($C35=2,OFFSET(F35,-1,0)+1,OFFSET(F35,-1,0)))","v":2},{"$f":"IF(AND($C35<=2,$C35<>0),0,IF($C35=3,OFFSET(G35,-1,0)+1,OFFSET(G35,-1,0)))","v":0},{"$f":"IF(AND($C35<=3,$C35<>0),0,IF($C35=4,OFFSET(H35,-1,0)+1,OFFSET(H35,-1,0)))","v":0},{"$f":"IF(AND($C35<=4,$C35<>0),0,IF(AND($C35=\"S\",$W35>0),OFFSET(I35,-1,0)+1,OFFSET(I35,-1,0)))","v":0},155,3,{"$f":"IF(OR(W35>0,$C35=1),\"F\",\"\")","v":""},"Nível 2",{"$f":"CHOOSE(1+LOG(1+2*(C35=1)+4*(C35=2)+8*(C35=3)+16*(C35=4)+32*(C35=\"S\"),2),\"\",\"Nível 1\",\"Nível 2\",\"Nível 3\",\"Nível 4\",\"Serviço\")","v":"Nível 2"},"1.2.","AGETOP",null,"TRANSPORTES","-",null,null,null,null,"",null,{"$f":"IFERROR(VLOOKUP(Q35,INDIRECT(\"EQUIVALÊNCIAS\"),4,FALSE),\"\")","v":""},{"$f":"IFERROR(VLOOKUP(Q35,INDIRECT(\"EQUIVALÊNCIAS\"),5,FALSE),\"\")","v":""},{"$f":"IFERROR(IF(OR($C35=0,$C35=1,$C35=2,$C35=3,$C35=4),R35,VLOOKUP($AA35,INDIRECT($Z35),2,FALSE)),\"(sem código)\")","v":"TRANSPORTES"},{"$f":"IFERROR(VLOOKUP(AA35,INDIRECT(Z35),3,FALSE()),\"-\")","v":"-"},{"$f":"IFERROR(VLOOKUP($AA35,INDIRECT($Z35),IF($T$11=\"DESONERADA\",4,7),FALSE()),0)","v":0},{"$f":"IFERROR(VLOOKUP($AA35,INDIRECT($Z35),IF($T$11=\"DESONERADA\",5,8),FALSE()),0)","v":0}]
["S",2,"S",0,1,2,0,0,0,0,0,"","Serviço","Serviço","1.2.0.1.","SINAPI",72900,"TRANSPORTE DE ENTULHO COM CAMINHAO BASCULANTE 6 M3, RODOVIA PAVIMENTADA, DMT 0,5 A 1,0 KM","M3",11.019500000000001,null,null,null,"","NÃO","","","(sem código)","-",0,0]
["S",2,"S",0,1,2,0,0,0,0,0,"","Serviço","Serviço","1.2.0.2.","SINAPI",72897,"CARGA MANUAL DE ENTULHO EM CAMINHAO BASCULANTE 6 M3","M3",11.019500000000001,null,null,null,"","NÃO","","","(sem código)","-",0,0]
[2,2,2,18,1,3,0,0,0,152,18,"","Nível 2","Nível 2","1.3.","AGETOP",null,"SERVIÇO EM TERRA","-",null,null,null,null,"",null,"","","SERVIÇO EM TERRA","-",0,0]
[3,3,3,8,1,3,1,0,0,17,8,"","Nível 3","Nível 3","1.3.1.","SINAPI",null,"BLOCO PADRÃO","-",null,null,null,null,"",null,"","","BLOCO PADRÃO","-",0,0]
["S",3,"S",0,1,3,1,0,0,0,0,"","Serviço","Serviço","1.3.1.1.","SINAPI",79480,"ESCAVACAO MECANICA CAMPO ABERTO EM SOLO EXCETO ROCHA ATE 2,00M PROFUNDIDADE","M3",13.85,null,null,null,"Referência: AGETOP - 41004","SIM","","","(sem código)","-",0,0]
["S",3,"S",0,1,3,1,0,0,0,0,"","Serviço","Serviço","1.3.1.2.","AGETOP",41005,"CARGA MECANIZADA","m3    ",13.85,null,null,null,"",null,"","","(sem código)","-",0,0]
["S",3,"S",0,1,3,1,0,0,0,0,"","Serviço","Serviço","1.3.1.3.","AGETOP",41012,"INDENIZAÇÃO DE JAZIDA","m3    ",13.85,null,null,null,"",null,"","","(sem código)","-",0,0]
["S",3,"S",0,1,3,1,0,0,0,0,"","Serviço","Serviço","1.3.1.4.","AGETOP",41006,"TRANSPORTE DE MATERIAL ESCAVADO M3.KM","m3km  ",138.5,null,null,null,"",null,"","","(sem código)","-",0,0]
["S",3,"S",0,1,3,1,0,0,0,0,"","Serviço","Serviço","1.3.1.5.","SINAPI","74005/1","COMPACTACAO MECANICA, SEM CONTROLE DO GC (C/COMPACTADOR PLACA 400 KG)","M3",11.08,null,null,null,"Referência: AGETOP - 41009","SIM","","","(sem código)","-",0,0]
["S",3,"S",0,1,3,1,0,0,0,0,"","Serviço","Serviço","1.3.1.6.","AGETOP",41140,"REGULARIZAÇÃO DO TERRENO SEM APILOAMENTO COM TRANSPORTE MANUAL DA TERRA ESCAVADA ","m2    ",88.69,null,null,null,"",null,"","","(sem código)","-",0,0]
["S",3,"S",0,1,3,1,0,0,0,0,"","Serviço","Serviço","1.3.1.7.","AGETOP",41002,"APILOAMENTO","m2    ",88.69,null,null,null,"",null,"","","(sem código)","-",0,0]
[3,3,3,3,1,3,2,0,0,9,3,"","Nível 3","Nível 3","1.3.2.","SINAPI",null,"INST. DE INCÊNDIO","-",null,null,null,null,"",null,"","","INST. DE INCÊNDIO","-",0,0]
["S",3,"S",0,1,3,2,0,0,0,0,"","Serviço","Serviço","1.3.2.1.","AGETOP",40101,"ESCAVACAO MANUAL DE VALAS < 1 MTS. (OBRAS CIVIS)","m3    ",33.4,null,null,null,"",null,"","","(sem código)","-",0,0]
["S",3,"S",0,1,3,2,0,0,0,0,"","Serviço","Serviço","1.3.2.2.","AGETOP",40902,"REATERRO COM APILOAMENTO","m3    ",33.4,null,null,null,"",null,"","","(sem código)","-",0,0]
[3,3,3,3,1,3,3,0,0,6,3,"","Nível 3","Nível 3","1.3.3.","SINAPI",null,"CENTRAL DE GÁS","-",null,null,null,null,"",null,"","","CENTRAL DE GÁS","-",0,0]
["S",3,"S",0,1,3,3,0,0,0,0,"","Serviço","Serviço","1.3.3.1.","SINAPI",93358,"ESCAVAÇÃO MANUAL DE VALA COM PROFUNDIDADE MENOR OU IGUAL A 1,30 M. AF_03/2016","M3",0.18,null,null,null,"Referência: AGETOP - 40101","SIM","","","(sem código)","-",0,0]
["S",3,"S",0,1,3,3,0,0,{"$f":"IF(OR($C52=\"S\",$C52=0),0,MATCH(0,OFFSET($D52,1,$C52,ROW($C$333)-ROW($C52)),0))","v":0},{"$f":"IF(OR($C52=\"S\",$C52=0),0,MATCH(OFFSET($D52,0,$C52)+1,OFFSET($D52,1,$C52,ROW($C$333)-ROW($C52)),0))","v":0},"","Serviço","Serviço","1.3.3.2.","SINAPI",96995,"REATERRO MANUAL APILOADO COM SOQUETE. AF_10/2017","M3",0.18,null,null,null,"Referência: AGETOP - 40902","SIM","","","(sem código)","-",0,0]
[3,3,3,3,1,3,4,0,0,3,{"$error":"#N/A"},"","Nível 3","Nível 3","1.3.4.","SINAPI",null,"INST. HIDROSSANITÁRIAS","-",null,null,null,null,"",null,"","","INST. HIDROSSANITÁRIAS","-",0,0]
["S",3,"S",0,1,3,4,0,0,0,0,"","Serviço","Serviço","1.3.4.1.","AGETOP",40101,"ESCAVACAO MANUAL DE VALAS < 1 MTS. (OBRAS CIVIS)","m3    ",5.25,null,null,null,"",null,"","","(sem código)","-",0,0]
["S",3,"S",0,1,3,4,0,0,0,0,"","Serviço","Serviço","1.3.4.2.","AGETOP",40902,"REATERRO COM APILOAMENTO","m3    ",5.25,null,null,null,"",null,"","","(sem código)","-",0,0]
[{"$f":"CHOOSE(1+LOG(1+2*(ORÇAMENTO.Nivel=\"Nível 1\")+4*(ORÇAMENTO.Nivel=\"Nível 2\")+8*(ORÇAMENTO.Nivel=\"Nível 3\")+16*(ORÇAMENTO.Nivel=\"Nível 4\")+32*(ORÇAMENTO.Nivel=\"Serviço\"),2),0,1,2,3,4,\"S\")","v":2},{"$f":"IF(OR(C56=\"s\",C56=0),OFFSET(B56,-1,0),C56)","v":2},{"$f":"IF(OFFSET(C56,-1,0)=\"L\",1,IF(OFFSET(C56,-1,0)=1,2,IF(OR(A56=\"s\",A56=0),\"S\",IF(AND(OFFSET(C56,-1,0)=2,A56=4),3,IF(AND(OR(OFFSET(C56,-1,0)=\"s\",OFFSET(C56,-1,0)=0),A56<>\"s\",A56>OFFSET(B56,-1,0)),OFFSET(B56,-1,0),A56)))))","v":2},{"$f":"IF(OR(C56=\"S\",C56=0),0,IF(ISERROR(K56),J56,SMALL(J56:K56,1)))","v":22},{"$f":"IF($C56=1,OFFSET(E56,-1,0)+1,OFFSET(E56,-1,0))","v":1},{"$f":"IF($C56=1,0,IF($C56=2,OFFSET(F56,-1,0)+1,OFFSET(F56,-1,0)))","v":4},{"$f":"IF(AND($C56<=2,$C56<>0),0,IF($C56=3,OFFSET(G56,-1,0)+1,OFFSET(G56,-1,0)))","v":0},{"$f":"IF(AND($C56<=3,$C56<>0),0,IF($C56=4,OFFSET(H56,-1,0)+1,OFFSET(H56,-1,0)))","v":0},{"$f":"IF(AND($C56<=4,$C56<>0),0,IF(AND($C56=\"S\",$W56>0),OFFSET(I56,-1,0)+1,OFFSET(I56,-1,0)))","v":0},134,22,{"$f":"IF(OR(W56>0,$C56=1),\"F\",\"\")","v":""},"Nível 2",{"$f":"CHOOSE(1+LOG(1+2*(C56=1)+4*(C56=2)+8*(C56=3)+16*(C56=4)+32*(C56=\"S\"),2),\"\",\"Nível 1\",\"Nível 2\",\"Nível 3\",\"Nível 4\",\"Serviço\")","v":"Nível 2"},"1.4.",null,null,"INSTALAÇÕES ELÉTRICAS","-",null,null,null,null,"",null,{"$f":"IFERROR(VLOOKUP(Q56,INDIRECT(\"EQUIVALÊNCIAS\"),4,FALSE),\"\")","v":""},{"$f":"IFERROR(VLOOKUP(Q56,INDIRECT(\"EQUIVALÊNCIAS\"),5,FALSE),\"\")","v":""},{"$f":"IFERROR(IF(OR($C56=0,$C56=1,$C56=2,$C56=3,$C56=4),R56,VLOOKUP($AA56,INDIRECT($Z56),2,FALSE)),\"(sem código)\")","v":"INSTALAÇÕES ELÉTRICAS"},{"$f":"IFERROR(VLOOKUP(AA56,INDIRECT(Z56),3,FALSE()),\"-\")","v":"-"},{"$f":"IFERROR(VLOOKUP($AA56,INDIRECT($Z56),IF($T$11=\"DESONERADA\",4,7),FALSE()),0)","v":0},{"$f":"IFERROR(VLOOKUP($AA56,INDIRECT($Z56),IF($T$11=\"DESONERADA\",5,8),FALSE()),0)","v":0}]
[3,3,3,14,1,4,1,0,0,21,14,"","Nível 3","Nível 3","1.4.1.","SINAPI",null,"SPDA","-",null,null,null,null,"",null,"","","SPDA","-",0,0]
["S",3,"S",0,1,4,1,0,0,0,0,"","Serviço","Serviço","1.4.1.1.","COMPOSIÇÃO","COMP 034_SEE","TERMINAL AÉREO SPDA 30CM Fo Go DIAM. 5/16\" COM SUPORTE","UN ",68,null,null,null,"",null,"","","(sem código)","-",0,0]
["S",3,"S",0,1,4,1,0,0,0,0,"","Serviço","Serviço","1.4.1.2.","AGETOP",70543,"CABO DE COBRE NÚ No. 35 MM2","M     ",1482,null,null,null,"",null,"","","(sem código)","-",0,0]
["S",3,"S",0,1,4,1,0,0,0,0,"","Serviço","Serviço","1.4.1.3.","AGETOP",70544,"CABO DE COBRE NÚ No. 50 MM2","M     ",1120,null,null,null,"",null,"","","(sem código)","-",0,0]
["S",3,"S",0,1,4,1,0,0,0,0,"","Serviço","Serviço","1.4.1.4.","AGETOP",71202,"ELETRODUTO DE PVC RIGIDO DIAMETRO 1\"","M     ",116,null,null,null,"",null,"","","(sem código)","-",0,0]
["S",3,"S",0,1,4,1,0,0,0,0,"","Serviço","Serviço","1.4.1.5.","COMPOSIÇÃO","COMP 035_SEE","CLIPS 3/8 P/ CABO DE AÇO BELGO","UN ",706,null,null,null,"",null,"","","(sem código)","-",0,0]
["S",3,"S",0,1,4,1,0,0,0,0,"","Serviço","Serviço","1.4.1.6.","COMPOSIÇÃO","COMP 036_SEE","PRESILHA LATÃO 16/35MM 5MM+PARAF FENDA ","UN ",482,null,null,null,"",null,"","","(sem código)","-",0,0]
["S",3,"S",0,1,4,1,0,0,0,0,"","Serviço","Serviço","1.4.1.7.","AGETOP",71035,"CONECTOR TIPO PARAFUSO FENDIDO 35 MM2","Un    ",55,null,null,null,"",null,"","","(sem código)","-",0,0]
["S",3,"S",0,1,4,1,0,0,0,0,"","Serviço","Serviço","1.4.1.8.","AGETOP",72661,"VERGALHAO ROSCA TOTAL D=5/16\"","M     ",224,null,null,null,"",null,"","","(sem código)","-",0,0]
["S",3,"S",0,1,4,1,0,0,0,0,"","Serviço","Serviço","1.4.1.9.","AGETOP",70372,"BRACADEIRA METALICA TIPO \"D\" DIAM. 1\"","Un    ",156,null,null,null,"",null,"","","(sem código)","-",0,0]
["S",3,"S",0,1,4,1,0,0,0,0,"","Serviço","Serviço","1.4.1.10.","COMPOSIÇÃO","COMP 037_SEE","CAIXA DE INSPEÇÃO PVC 300X250MM+TP P/CX INSP GALV FOGO 300MM","UN ",46,null,null,null,"",null,"","","(sem código)","-",0,0]
["S",3,"S",0,1,4,1,0,0,0,0,"","Serviço","Serviço","1.4.1.11.","AGETOP",70255,"ATERRAMENTO - SOLDA EXOTÉRMICA - CARTUCHO 90 G","un    ",82,null,null,null,"",null,"","","(sem código)","-",0,0]
["S",3,"S",0,1,4,1,0,0,0,0,"","Serviço","Serviço","1.4.1.12.","AGETOP",71381,"HASTE REV.COBRE(COPPERWELD)  5/8\" X 3,00 M C/CONECTOR","Un    ",46,null,null,null,"",null,"","","(sem código)","-",0,0]
["S",3,"S",0,1,4,1,0,0,0,0,"","Serviço","Serviço","1.4.1.13.","AGETOP",71831,"PARA RAIOS FRANKLIM 4 PONTAS","Un    ",1,null,null,null,"",null,"","","(sem código)","-",0,0]
[3,3,3,7,1,4,2,0,0,7,13,"","Nível 3","Nível 3","1.4.2.",null,null,"INST. ELÉTRICAS","-",null,null,null,null,"",null,"","","INST. ELÉTRICAS","-",0,0]
["S",3,"S",0,1,4,2,0,0,0,0,"","Serviço","Serviço","1.4.2.1.","SINAPI",91931,"CABO DE COBRE FLEXÍVEL ISOLADO, 6 MM², ANTI-CHAMA 0,6/1,0 KV, PARA CIRCUITOS TERMINAIS - FORNECIMENTO E INSTALAÇÃO. AF_12/2015","M",413,null,null,null,"Referência: AGETOP - 70583","SIM","","","(sem código)","-",0,0]
["S",3,"S",0,1,4,2,0,0,0,0,"","Serviço","Serviço","1.4.2.2.","SINAPI",97891,"CAIXA ENTERRADA ELÉTRICA RETANGULAR, EM ALVENARIA COM BLOCOS DE CONCRETO, FUNDO COM BRITA, DIMENSÕES INTERNAS: 0,4X0,4X0,4 M. AF_05/2018","UN",1,null,null,null,"",null,"","","(sem código)","-",0,0]
["S",3,"S",0,1,4,2,0,0,0,0,"","Serviço","Serviço","1.4.2.3.","SINAPI",93671,"DISJUNTOR TRIPOLAR TIPO DIN, CORRENTE NOMINAL DE 32A - FORNECIMENTO E INSTALAÇÃO. AF_04/2016","UN",1,null,null,null,"Referência: AGETOP - 71173","SIM","","","(sem código)","-",0,0]
["S",3,"S",0,1,4,2,0,0,0,0,"","Serviço","Serviço","1.4.2.4.","SINAPI",91846,"ELETRODUTO FLEXÍVEL CORRUGADO, PVC, DN 32 MM (1\"), PARA CIRCUITOS TERMINAIS, INSTALADO EM LAJE - FORNECIMENTO E INSTALAÇÃO. AF_12/2015","M",82.6,null,null,null,"","NÃO","","","(sem código)","-",0,0]
["S",3,"S",0,1,4,2,0,0,0,0,"","Serviço","Serviço","1.4.2.5.","AGETOP",71321,"FITA DE AUTO FUSAO, ROLO E 10,00 MM","Un    ",5,null,null,null,"",null,"","","(sem código)","-",0,0]
["S",3,"S",0,1,4,2,0,0,0,0,"","Serviço","Serviço","1.4.2.6.","AGETOP",71331,"FITA ISOLANTE, ROLO DE 20,00 M","Un    ",5,null,null,null,"",null,"","","(sem código)","-",0,0]
[{"$f":"CHOOSE(1+LOG(1+2*(ORÇAMENTO.Nivel=\"Nível 1\")+4*(ORÇAMENTO.Nivel=\"Nível 2\")+8*(ORÇAMENTO.Nivel=\"Nível 3\")+16*(ORÇAMENTO.Nivel=\"Nível 4\")+32*(ORÇAMENTO.Nivel=\"Serviço\"),2),0,1,2,3,4,\"S\")","v":2},{"$f":"IF(OR(C78=\"s\",C78=0),OFFSET(B78,-1,0),C78)","v":2},{"$f":"IF(OFFSET(C78,-1,0)=\"L\",1,IF(OFFSET(C78,-1,0)=1,2,IF(OR(A78=\"s\",A78=0),\"S\",IF(AND(OFFSET(C78,-1,0)=2,A78=4),3,IF(AND(OR(OFFSET(C78,-1,0)=\"s\",OFFSET(C78,-1,0)=0),A78<>\"s\",A78>OFFSET(B78,-1,0)),OFFSET(B78,-1,0),A78)))))","v":2},{"$f":"IF(OR(C78=\"S\",C78=0),0,IF(ISERROR(K78),J78,SMALL(J78:K78,1)))","v":52},{"$f":"IF($C78=1,OFFSET(E78,-1,0)+1,OFFSET(E78,-1,0))","v":1},{"$f":"IF($C78=1,0,IF($C78=2,OFFSET(F78,-1,0)+1,OFFSET(F78,-1,0)))","v":5},{"$f":"IF(AND($C78<=2,$C78<>0),0,IF($C78=3,OFFSET(G78,-1,0)+1,OFFSET(G78,-1,0)))","v":0},{"$f":"IF(AND($C78<=3,$C78<>0),0,IF($C78=4,OFFSET(H78,-1,0)+1,OFFSET(H78,-1,0)))","v":0},{"$f":"IF(AND($C78<=4,$C78<>0),0,IF(AND($C78=\"S\",$W78>0),OFFSET(I78,-1,0)+1,OFFSET(I78,-1,0)))","v":0},112,52,{"$f":"IF(OR(W78>0,$C78=1),\"F\",\"\")","v":""},"Nível 2",{"$f":"CHOOSE(1+LOG(1+2*(C78=1)+4*(C78=2)+8*(C78=3)+16*(C78=4)+32*(C78=\"S\"),2),\"\",\"Nível 1\",\"Nível 2\",\"Nível 3\",\"Nível 4\",\"Serviço\")","v":"Nível 2"},"1.5.","AGETOP",null,"INSTALAÇÕES HIDROSSANITÁRIAS","-",null,null,null,null,"",null,{"$f":"IFERROR(VLOOKUP(Q78,INDIRECT(\"EQUIVALÊNCIAS\"),4,FALSE),\"\")","v":""},{"$f":"IFERROR(VLOOKUP(Q78,INDIRECT(\"EQUIVALÊNCIAS\"),5,FALSE),\"\")","v":""},{"$f":"IFERROR(IF(OR($C78=0,$C78=1,$C78=2,$C78=3,$C78=4),R78,VLOOKUP($AA78,INDIRECT($Z78),2,FALSE)),\"(sem código)\")","v":"INSTALAÇÕES HIDROSSANITÁRIAS"},{"$f":"IFERROR(VLOOKUP(AA78,INDIRECT(Z78),3,FALSE()),\"-\")","v":"-"},0,0]
[3,3,3,3,1,5,1,0,0,51,3,"","Nível 3","Nível 3","1.5.1.","SINAPI",null,"ESGOTO SANITÁRIO","-",null,null,null,null,"",null,"","","ESGOTO SANITÁRIO","-",0,0]
["S",3,"S",0,1,5,1,0,0,0,0,"","Serviço","Serviço","1.5.1.1.","SINAPI",89799,"TUBO PVC, SERIE NORMAL, ESGOTO PREDIAL, DN 75 MM, FORNECIDO E INSTALADO EM PRUMADA DE ESGOTO SANITÁRIO OU VENTILAÇÃO. AF_12/2014","M",15,null,null,null,"","NÃO","","","(sem código)","-",0,0]
["S",3,"S",0,1,5,1,0,0,0,0,"","Serviço","Serviço","1.5.1.2.","SINAPI",89800,"TUBO PVC, SERIE NORMAL, ESGOTO PREDIAL, DN 100 MM, FORNECIDO E INSTALADO EM PRUMADA DE ESGOTO SANITÁRIO OU VENTILAÇÃO. AF_12/2014","M",6,null,null,null,"","NÃO","","","(sem código)","-",0,0]
[3,3,3,2,1,5,2,0,0,48,2,"","Nível 3","Nível 3","1.5.2.","SINAPI",null,"OUTROS","-",null,null,null,null,"",null,"","","OUTROS","-",0,0]
["S",3,"S",0,1,5,2,0,0,0,0,"","Serviço","Serviço","1.5.2.1.","AGETOP",81828,"CAIXA DE AREIA 60X60CM FUNDO DE BRITA COM GRELHA METÁLICA FERRO CHATO PADRÃO GOINFRA","Un    ",1,null,null,null,"",null,"","","(sem código)","-",0,0]
[3,3,3,46,1,5,3,0,0,{"$f":"IF(OR($C84=\"S\",$C84=0),0,MATCH(0,OFFSET($D84,1,$C84,ROW($C$333)-ROW($C84)),0))","v":46},{"$f":"IF(OR($C84=\"S\",$C84=0),0,MATCH(OFFSET($D84,0,$C84)+1,OFFSET($D84,1,$C84,ROW($C$333)-ROW($C84)),0))","v":88},"","Nível 3","Nível 3","1.5.3.","SINAPI",null,"INSTALAÇÕES DE INCÊNDIO","-",null,null,null,null,"",null,"","","INSTALAÇÕES DE INCÊNDIO","-",0,0]
["S",3,"S",0,1,5,3,0,0,0,0,"","Serviço","Serviço","1.5.3.1.","COMPOSIÇÃO","COMP 040_SEE","CONJUNTO MOTOR-BOMBA ELÉTRICA TRIFÁSICO 380/220 V PARA VZ= 24,33 M³/H, HM= 46,24 M POTÊNCIA= 7,5 CV","UN ",1,null,null,null,"",null,"","","(sem código)","-",0,0]
["S",3,"S",0,1,5,3,0,0,0,0,"","Serviço","Serviço","1.5.3.2.","AGETOP",81882,"RES.METALICO TAÇA AÇO PATINÁVEL-V=15M3-COL.SEC.H=6M+FUNDAÇÃO+LOGOTIPO","Un    ",1,null,null,null,"",null,"","","(sem código)","-",0,0]
["S",3,"S",0,1,5,3,0,0,0,0,"","Serviço","Serviço","1.5.3.3.","AGETOP",81889,"TORNEIRA BOIA DIAMETRO 1\" (25 MM )","Un    ",1,null,null,null,"",null,"","","(sem código)","-",0,0]
["S",3,"S",0,1,5,3,0,0,0,0,"","Serviço","Serviço","1.5.3.4.","AGETOP",71156,"CURVA DE 90 GRAUS AÇO GALVANIZADO DIAM. 2.1/2\"","Un    ",1,null,null,null,"",null,"","","(sem código)","-",0,0]
["S",3,"S",0,1,5,3,0,0,0,0,"","Serviço","Serviço","1.5.3.5.","AGETOP",71706,"LUVA  EM AÇO GALVANIZADO DIÂMETRO 2.1/2\"","Un    ",2,null,null,null,"",null,"","","(sem código)","-",0,0]
["S",3,"S",0,1,5,3,0,0,0,0,"","Serviço","Serviço","1.5.3.6.","AGETOP",80910,"REGISTRO DE GAVETA BRUTO DIAMETRO 2.1/2\"","Un    ",2,null,null,null,"",null,"","","(sem código)","-",0,0]
["S",3,"S",0,1,5,3,0,0,0,0,"","Serviço","Serviço","1.5.3.7.","AGETOP",82379,"TUBO FERRO GALVANIZADO DIAM.2.1/2\"","m     ",182,null,null,null,"",null,"","","(sem código)","-",0,0]
["S",3,"S",0,1,5,3,0,0,0,0,"","Serviço","Serviço","1.5.3.8.","AGETOP",81003,"TUBO SOLDAVEL PVC MARROM DIAMETRO 25 mm","M     ",9,null,null,null,"",null,"","","(sem código)","-",0,0]
["S",3,"S",0,1,5,3,0,0,0,0,"","Serviço","Serviço","1.5.3.9.","AGETOP",81321,"JOELHO 90 GRAUS SOLDAVEL DIAMETRO 25 MM","Un    ",4,null,null,null,"",null,"","","(sem código)","-",0,0]
["S",3,"S",0,1,5,3,0,0,0,0,"","Serviço","Serviço","1.5.3.10.","AGETOP",85003,"EXTINTOR PO QUIMICO SECO (6 KG) - CAPACIDADE EXTINTORA 20 BC","Un    ",2,null,null,null,"",null,"","","(sem código)","-",0,0]
["S",3,"S",0,1,5,3,0,0,0,0,"","Serviço","Serviço","1.5.3.11.","AGETOP",85006,"EXTINTOR MULTI USO EM PO A B C (6 KG) - CAPACIDADE EXTINTORA 3A 20BC","un    ",5,null,null,null,"",null,"","","(sem código)","-",0,0]
["S",3,"S",0,1,5,3,0,0,0,0,"","Serviço","Serviço","1.5.3.12.","AGETOP",85011,"CAIXA DE INCÊNDIO METÁLICA COM SUPORTE PARA MANGUEIRA, TAMPA E MURETA 17X60X90 CM C/PINTURA","Un    ",5,null,null,null,"",null,"","","(sem código)","-",0,0]
["S",3,"S",0,1,5,3,0,0,0,0,"","Serviço","Serviço","1.5.3.13.","AGETOP",85017,"MANGUEIRA DE INCÊNDIO D.I. = 38 MM TIPO 2 COMP. = 15 M","CJ    ",10,null,null,null,"",null,"","","(sem código)","-",0,0]
["S",3,"S",0,1,5,3,0,0,0,0,"","Serviço","Serviço","1.5.3.14.","AGETOP",85025,"ESGUICHO REGULÁVEL 1.1/2\"","Un    ",5,null,null,null,"",null,"","","(sem código)","-",0,0]
["S",3,"S",0,1,5,3,0,0,0,0,"","Serviço","Serviço","1.5.3.15.","AGETOP",85027,"ADAPTADOR P/ENGATE STORZ 2.1/2\" X 1.1/2\"","Un    ",6,null,null,null,"",null,"","","(sem código)","-",0,0]
["S",3,"S",0,1,5,3,0,0,0,0,"","Serviço","Serviço","1.5.3.16.","AGETOP",85031,"REGISTRO GLOBO ANGULAR 2.1/2\"","Un    ",5,null,null,null,"",null,"","","(sem código)","-",0,0]
["S",3,"S",0,1,5,3,0,0,0,0,"","Serviço","Serviço","1.5.3.17.","AGETOP",85035,"TAMPÃO CEGO COM CORRENTE 2.1/2\"","Un    ",1,null,null,null,"",null,"","","(sem código)","-",0,0]
["S",3,"S",0,1,5,3,0,0,0,0,"","Serviço","Serviço","1.5.3.18.","COMPOSIÇÃO","COMP 078_SEE","TAMPÃO CEGO COM CORRENTE 1 1/2\"","UN ",5,null,null,null,"",null,"","","(sem código)","-",0,0]
["S",3,"S",0,1,5,3,0,0,0,0,"","Serviço","Serviço","1.5.3.19.","AGETOP",85037,"TANQUE DE PRESSÃO DE 10 L","Un    ",1,null,null,null,"",null,"","","(sem código)","-",0,0]
["S",3,"S",0,1,5,3,0,0,0,0,"","Serviço","Serviço","1.5.3.20.","AGETOP",85039,"PRESSOSTATO 50 A 80 PSI","Un    ",1,null,null,null,"",null,"","","(sem código)","-",0,0]
["S",3,"S",0,1,5,3,0,0,0,0,"","Serviço","Serviço","1.5.3.21.","AGETOP",85041,"MANOMETRO - 0 A 10 KG/CM2","Un    ",1,null,null,null,"",null,"","","(sem código)","-",0,0]
["S",3,"S",0,1,5,3,0,0,0,0,"","Serviço","Serviço","1.5.3.22.","AGETOP",85047,"NIPLE DUPLO FERRO GALVANIZADO 2.1/2\"","Un    ",5,null,null,null,"",null,"","","(sem código)","-",0,0]
["S",3,"S",0,1,5,3,0,0,0,0,"","Serviço","Serviço","1.5.3.23.","SINAPI",92377,"NIPLE, EM FERRO GALVANIZADO, DN 65 (2 1/2\"), CONEXÃO ROSQUEADA, INSTALADO EM REDE DE ALIMENTAÇÃO PARA HIDRANTE - FORNECIMENTO E INSTALAÇÃO. AF_12/2015","UN",5,null,null,null,"",null,"","","(sem código)","-",0,0]
["S",3,"S",0,1,5,3,0,0,0,0,"","Serviço","Serviço","1.5.3.24.","AGETOP",85077,"VÁLVULA DE RETENÇÃO HORIZONTAL 2.1/2\"","Un    ",2,null,null,null,"",null,"","","(sem código)","-",0,0]
["S",3,"S",0,1,5,3,0,0,0,0,"","Serviço","Serviço","1.5.3.25.","COMPOSIÇÃO","COMP 017_SEE","REDUCAO GIRATÓRIA TIPO STORZ LATAO P/ INST. PREDIAL COMBATE A INCENDIO ENGATE RAPIDO 2.1/2\" X 1.1/2\"","UN ",5,null,null,null,"",null,"","","(sem código)","-",0,0]
["S",3,"S",0,1,5,3,0,0,0,0,"","Serviço","Serviço","1.5.3.26.","COMPOSIÇÃO","COMP 018_SEE","CHAVE DUPLA P/ CONEXÕES TIPO STORZ EM LATÃO ENGATE RÁPIDO 1 1/2\" X 2 1/2\"","UN ",5,null,null,null,"",null,"","","(sem código)","-",0,0]
["S",3,"S",0,1,5,3,0,0,0,0,"","Serviço","Serviço","1.5.3.27.","AGETOP",80981,"REGISTRO DE ESFERA DIAMETRO 2.1/2\"","Un    ",1,null,null,null,"",null,"","","(sem código)","-",0,0]
["S",3,"S",0,1,5,3,0,0,0,0,"","Serviço","Serviço","1.5.3.28.","COMPOSIÇÃO","COMP 087_SEE","REGISTRO DE GAVETA COM HASTE ASCENDENTE DE BRONZE 2 1/2\"","UN ",1,null,null,null,"",null,"","","(sem código)","-",0,0]
["S",3,"S",0,1,5,3,0,0,0,0,"","Serviço","Serviço","1.5.3.29.","AGETOP",85056,"TÊ DE FERRO GALVANIZADO 90º X 2 1/2\"","un    ",8,null,null,null,"",null,"","","(sem código)","-",0,0]
["S",3,"S",0,1,5,3,0,0,0,0,"","Serviço","Serviço","1.5.3.30.","COMPOSIÇÃO","COMP 030_SEE","COTOVELO DE FERRO GALV. 90° X 2 1/2\"","UN ",25,null,null,null,"",null,"","","(sem código)","-",0,0]
["S",3,"S",0,1,5,3,0,0,0,0,"","Serviço","Serviço","1.5.3.31.","COMPOSIÇÃO","COMP 077_SEE","UNIAO FERRO GALV C/ASSENTO CONICO BRONZE 2 1/2\"","UN ",6,null,null,null,"",null,"","","(sem código)","-",0,0]
["S",3,"S",0,1,5,3,0,0,{"$f":"IF(OR($C116=\"S\",$C116=0),0,MATCH(0,OFFSET($D116,1,$C116,ROW($C$333)-ROW($C116)),0))","v":0},{"$f":"IF(OR($C116=\"S\",$C116=0),0,MATCH(OFFSET($D116,0,$C116)+1,OFFSET($D116,1,$C116,ROW($C$333)-ROW($C116)),0))","v":0},"","Serviço","Serviço","1.5.3.32.","COMPOSIÇÃO","COMP 347_SEE","ADAPTADOR PVC SOLDAVEL, COM FLANGES LIVRES, 75 MM X 2 1/2\", PARA CAIXA D' AGUA","UN ",1,null,null,null,"",null,"","","(sem código)","-",0,0]
["S",3,"S",0,1,5,3,0,0,0,0,"","Serviço","Serviço","1.5.3.33.","COMPOSIÇÃO","COMP 022_SEE","TAMPÃO FOFO 40X50CM C/INSCRIÇÃO ","UN ",1,null,null,null,"",null,"","","(sem código)","-",0,0]
["S",3,"S",0,1,5,3,0,0,0,0,"","Serviço","Serviço","1.5.3.34.","COMPOSIÇÃO","COMP 546_SEE","BUJÃO DE REBORDO 2.1/2\"","UN ",1,null,null,null,"",null,"","","(sem código)","-",0,0]
["S",3,"S",0,1,5,3,0,0,0,0,"","Serviço","Serviço","1.5.3.35.","COMPOSIÇÃO","COMP 186_SEE","BOTOEIRA BOMBA DE INCÊNDIO C/ MARTELO CONVENCIONAL/ ANALÓGICA","UN ",1,null,null,null,"",null,"","","(sem código)","-",0,0]
["S",3,"S",0,1,5,3,0,0,0,0,"","Serviço","Serviço","1.5.3.36.","COMPOSIÇÃO","COMP 188_SEE","ACIONADOR MANUAL DE ALARME","UN ",5,null,null,null,"",null,"","","(sem código)","-",0,0]
["S",3,"S",0,1,5,3,0,0,0,0,"","Serviço","Serviço","1.5.3.37.","COMPOSIÇÃO","COMP 190_SEE","CENTRAL DE DETECÇÃO E ALARME DE 40 SETORES COM BATERIA","UN ",1,null,null,null,"",null,"","","(sem código)","-",0,0]
["S",3,"S",0,1,5,3,0,0,0,0,"","Serviço","Serviço","1.5.3.38.","SINAPI",97599,"LUMINÁRIA DE EMERGÊNCIA - FORNECIMENTO E INSTALAÇÃO. AF_11/2017","UN",23,null,null,null,"",null,"","","(sem código)","-",0,0]
["S",3,"S",0,1,5,3,0,0,0,0,"","Serviço","Serviço","1.5.3.39.","COMPOSIÇÃO","COMP 024_SEE","SINALIZADOR FOTOLUMINESCENTE PARA EXTINTOR","UN ",7,null,null,null,"",null,"","","(sem código)","-",0,0]
["S",3,"S",0,1,5,3,0,0,0,0,"","Serviço","Serviço","1.5.3.40.","COMPOSIÇÃO","COMP 025_SEE","SINALIZADOR FOTOLUMINESCENTE DE EMERGÊNCIA","UN ",20,null,null,null,"",null,"","","(sem código)","-",0,0]
["S",3,"S",0,1,5,3,0,0,0,0,"","Serviço","Serviço","1.5.3.41.","COMPOSIÇÃO","COMP 277_SEE","MARCAÇÃO NO PISO - 1X1 M PARA EXTINTOR","M2",7,null,null,null,"",null,"","","(sem código)","-",0,0]
["S",3,"S",0,1,5,3,0,0,0,0,"","Serviço","Serviço","1.5.3.42.","COMPOSIÇÃO","COMP 235_SEE","PLACA DE SINALIZAÇÃO EM PVC COD 01 - (300X300) PROIBIDO FUMAR","UN ",1,null,null,null,"",null,"","","(sem código)","-",0,0]
["S",3,"S",0,1,5,3,0,0,0,0,"","Serviço","Serviço","1.5.3.43.","COMPOSIÇÃO","COMP 236_SEE","PLACA DE SINALIZAÇÃO EM PVC COD 06 - (300X300) PERIGO INFLAMÁVEL","UN ",1,null,null,null,"",null,"","","(sem código)","-",0,0]
["S",3,"S",0,1,5,3,0,0,0,0,"","Serviço","Serviço","1.5.3.44.","COMPOSIÇÃO","COMP 411_SEE","PLACA DE SINALIZAÇÃO EM PVC COD 13 - (316X158) SAÍDA DE EMERGÊNCIA","UN ",1,null,null,null,"",null,"","","(sem código)","-",0,0]
[{"$f":"CHOOSE(1+LOG(1+2*(ORÇAMENTO.Nivel=\"Nível 1\")+4*(ORÇAMENTO.Nivel=\"Nível 2\")+8*(ORÇAMENTO.Nivel=\"Nível 3\")+16*(ORÇAMENTO.Nivel=\"Nível 4\")+32*(ORÇAMENTO.Nivel=\"Serviço\"),2),0,1,2,3,4,\"S\")","v":"S"},{"$f":"IF(OR(C129=\"s\",C129=0),OFFSET(B129,-1,0),C129)","v":3},{"$f":"IF(OFFSET(C129,-1,0)=\"L\",1,IF(OFFSET(C129,-1,0)=1,2,IF(OR(A129=\"s\",A129=0),\"S\",IF(AND(OFFSET(C129,-1,0)=2,A129=4),3,IF(AND(OR(OFFSET(C129,-1,0)=\"s\",OFFSET(C129,-1,0)=0),A129<>\"s\",A129>OFFSET(B129,-1,0)),OFFSET(B129,-1,0),A129)))))","v":"S"},{"$f":"IF(OR(C129=\"S\",C129=0),0,IF(ISERROR(K129),J129,SMALL(J129:K129,1)))","v":0},{"$f":"IF($C129=1,OFFSET(E129,-1,0)+1,OFFSET(E129,-1,0))","v":1},{"$f":"IF($C129=1,0,IF($C129=2,OFFSET(F129,-1,0)+1,OFFSET(F129,-1,0)))","v":5},{"$f":"IF(AND($C129<=2,$C129<>0),0,IF($C129=3,OFFSET(G129,-1,0)+1,OFFSET(G129,-1,0)))","v":3},{"$f":"IF(AND($C129<=3,$C129<>0),0,IF($C129=4,OFFSET(H129,-1,0)+1,OFFSET(H129,-1,0)))","v":0},{"$f":"IF(AND($C129<=4,$C129<>0),0,IF(AND($C129=\"S\",$W129>0),OFFSET(I129,-1,0)+1,OFFSET(I129,-1,0)))","v":0},0,0,{"$f":"IF(OR(W129>0,$C129=1),\"F\",\"\")","v":""},"Serviço",{"$f":"CHOOSE(1+LOG(1+2*(C129=1)+4*(C129=2)+8*(C129=3)+16*(C129=4)+32*(C129=\"S\"),2),\"\",\"Nível 1\",\"Nível 2\",\"Nível 3\",\"Nível 4\",\"Serviço\")","v":"Serviço"},"1.5.3.45.","COMPOSIÇÃO","COMP 412_SEE","PLACA DE SINALIZAÇÃO EM PVC COD 17 - (316X158) MENSAGEM \"SAÍDA\"","UN ",2,null,null,null,"",null,{"$f":"IFERROR(VLOOKUP(Q129,INDIRECT(\"EQUIVALÊNCIAS\"),4,FALSE),\"\")","v":""},{"$f":"IFERROR(VLOOKUP(Q129,INDIRECT(\"EQUIVALÊNCIAS\"),5,FALSE),\"\")","v":""},{"$f":"IFERROR(IF(OR($C129=0,$C129=1,$C129=2,$C129=3,$C129=4),R129,VLOOKUP($AA129,INDIRECT($Z129),2,FALSE)),\"(sem código)\")","v":"(sem código)"},{"$f":"IFERROR(VLOOKUP(AA129,INDIRECT(Z129),3,FALSE()),\"-\")","v":"-"},{"$f":"IFERROR(VLOOKUP($AA129,INDIRECT($Z129),IF($T$11=\"DESONERADA\",4,7),FALSE()),0)","v":0},{"$f":"IFERROR(VLOOKUP($AA129,INDIRECT($Z129),IF($T$11=\"DESONERADA\",5,8),FALSE()),0)","v":0}]
[{"$f":"CHOOSE(1+LOG(1+2*(ORÇAMENTO.Nivel=\"Nível 1\")+4*(ORÇAMENTO.Nivel=\"Nível 2\")+8*(ORÇAMENTO.Nivel=\"Nível 3\")+16*(ORÇAMENTO.Nivel=\"Nível 4\")+32*(ORÇAMENTO.Nivel=\"Serviço\"),2),0,1,2,3,4,\"S\")","v":2},{"$f":"IF(OR(C130=\"s\",C130=0),OFFSET(B130,-1,0),C130)","v":2},{"$f":"IF(OFFSET(C130,-1,0)=\"L\",1,IF(OFFSET(C130,-1,0)=1,2,IF(OR(A130=\"s\",A130=0),\"S\",IF(AND(OFFSET(C130,-1,0)=2,A130=4),3,IF(AND(OR(OFFSET(C130,-1,0)=\"s\",OFFSET(C130,-1,0)=0),A130<>\"s\",A130>OFFSET(B130,-1,0)),OFFSET(B130,-1,0),A130)))))","v":2},{"$f":"IF(OR(C130=\"S\",C130=0),0,IF(ISERROR(K130),J130,SMALL(J130:K130,1)))","v":26},{"$f":"IF($C130=1,OFFSET(E130,-1,0)+1,OFFSET(E130,-1,0))","v":1},{"$f":"IF($C130=1,0,IF($C130=2,OFFSET(F130,-1,0)+1,OFFSET(F130,-1,0)))","v":6},{"$f":"IF(AND($C130<=2,$C130<>0),0,IF($C130=3,OFFSET(G130,-1,0)+1,OFFSET(G130,-1,0)))","v":0},{"$f":"IF(AND($C130<=3,$C130<>0),0,IF($C130=4,OFFSET(H130,-1,0)+1,OFFSET(H130,-1,0)))","v":0},{"$f":"IF(AND($C130<=4,$C130<>0),0,IF(AND($C130=\"S\",$W130>0),OFFSET(I130,-1,0)+1,OFFSET(I130,-1,0)))","v":0},60,26,{"$f":"IF(OR(W130>0,$C130=1),\"F\",\"\")","v":""},"Nível 2",{"$f":"CHOOSE(1+LOG(1+2*(C130=1)+4*(C130=2)+8*(C130=3)+16*(C130=4)+32*(C130=\"S\"),2),\"\",\"Nível 1\",\"Nível 2\",\"Nível 3\",\"Nível 4\",\"Serviço\")","v":"Nível 2"},"1.6.",null,null,"INSTALAÇÕES ESPECIAIS","-",null,null,null,null,"",null,{"$f":"IFERROR(VLOOKUP(Q130,INDIRECT(\"EQUIVALÊNCIAS\"),4,FALSE),\"\")","v":""},{"$f":"IFERROR(VLOOKUP(Q130,INDIRECT(\"EQUIVALÊNCIAS\"),5,FALSE),\"\")","v":""},{"$f":"IFERROR(IF(OR($C130=0,$C130=1,$C130=2,$C130=3,$C130=4),R130,VLOOKUP($AA130,INDIRECT($Z130),2,FALSE)),\"(sem código)\")","v":"INSTALAÇÕES ESPECIAIS"},{"$f":"IFERROR(VLOOKUP(AA130,INDIRECT(Z130),3,FALSE()),\"-\")","v":"-"},{"$f":"IFERROR(VLOOKUP($AA130,INDIRECT($Z130),IF($T$11=\"DESONERADA\",4,7),FALSE()),0)","v":0},{"$f":"IFERROR(VLOOKUP($AA130,INDIRECT($Z130),IF($T$11=\"DESONERADA\",5,8),FALSE()),0)","v":0}]
[3,3,3,25,1,6,1,0,0,25,28,"","Nível 3","Nível 3","1.6.1.","SINAPI",null,"CENTRAL DE GÁS","-",null,null,null,null,"",null,"","","CENTRAL DE GÁS","-",0,0]
["S",3,"S",0,1,6,1,0,0,0,0,"","Serviço","Serviço","1.6.1.1.","AGETOP",91007,"CENTRAL DE GÁS PADRÃO GOINFRA SEM INSTALAÇÕES (1+1 CILINDRO 45 KG)","Un    ",1,null,null,null,"",null,"","","(sem código)","-",0,0]
["S",3,"S",0,1,6,1,0,0,0,0,"","Serviço","Serviço","1.6.1.2.","AGETOP",91023,"UNIÃO S/BRONZE PRETA 3/4\" NPT 300 LBS","Un    ",3,null,null,null,"",null,"","","(sem código)","-",0,0]
["S",3,"S",0,1,6,1,0,0,0,0,"","Serviço","Serviço","1.6.1.3.","COMPOSIÇÃO","COMP 382_SEE","TE DE REDUCAO DE FERRO GALVANIZADO, COM ROSCA BSP, DE 3/4\" X 1/2\"","UN ",1,null,null,null,"",null,"","","(sem código)","-",0,0]
["S",3,"S",0,1,6,1,0,0,0,0,"","Serviço","Serviço","1.6.1.4.","COMPOSIÇÃO","COMP 383_SEE","BUCHA DE REDUCAO DE FERRO GALVANIZADO, COM ROSCA BSP, DE 1/2\" X 1/4\"","UN ",3,null,null,null,"",null,"","","(sem código)","-",0,0]
["S",3,"S",0,1,6,1,0,0,0,0,"","Serviço","Serviço","1.6.1.5.","AGETOP",91021,"LUVA GALVANIZADO DE REDUÇÃO 3/4\" X 1/2\" (GÁS)","Un    ",2,null,null,null,"",null,"","","(sem código)","-",0,0]
["S",3,"S",0,1,6,1,0,0,0,0,"","Serviço","Serviço","1.6.1.6.","SINAPI",92692,"NIPLE, EM FERRO GALVANIZADO, CONEXÃO ROSQUEADA, DN 15 (1/2\"), INSTALADO EM RAMAIS E SUB-RAMAIS DE GÁS - FORNECIMENTO E INSTALAÇÃO. AF_12/2015","UN",6,null,null,null,"",null,"","","(sem código)","-",0,0]
["S",3,"S",0,1,6,1,0,0,0,0,"","Serviço","Serviço","1.6.1.7.","AGETOP",91031,"NIPLE DUPLO 300 PSI 3/4\"","Un    ",6,null,null,null,"",null,"","","(sem código)","-",0,0]
["S",3,"S",0,1,6,1,0,0,0,0,"","Serviço","Serviço","1.6.1.8.","COMPOSIÇÃO","COMP 212_SEE","NIPLE DE REDUÇÃO 1/2\" X 1/4\" BSP","UN ",4,null,null,null,"",null,"","","(sem código)","-",0,0]
["S",3,"S",0,1,6,1,0,0,0,0,"","Serviço","Serviço","1.6.1.9.","COMPOSIÇÃO","COMP 213_SEE","NIPLE DE REDUÇÃO 3/4\" X 1/2\" BSP","UN ",4,null,null,null,"",null,"","","(sem código)","-",0,0]
["S",3,"S",0,1,6,1,0,0,0,0,"","Serviço","Serviço","1.6.1.10.","SINAPI",92688,"TUBO DE AÇO GALVANIZADO COM COSTURA, CLASSE MÉDIA, CONEXÃO ROSQUEADA, DN 20 (3/4\"), INSTALADO EM RAMAIS E SUB-RAMAIS DE GÁS - FORNECIMENTO E INSTALAÇÃO. AF_12/2015","M",9,null,null,null,"",null,"","","(sem código)","-",0,0]
["S",3,"S",0,1,6,1,0,0,0,0,"","Serviço","Serviço","1.6.1.11.","SINAPI",92701,"JOELHO 90 GRAUS, EM FERRO GALVANIZADO, CONEXÃO ROSQUEADA, DN 20 (3/4\"), INSTALADO EM RAMAIS E SUB-RAMAIS DE GÁS - FORNECIMENTO E INSTALAÇÃO. AF_12/2015","UN",3,null,null,null,"",null,"","","(sem código)","-",0,0]
["S",3,"S",0,1,6,1,0,0,0,0,"","Serviço","Serviço","1.6.1.12.","COMPOSIÇÃO","COMP 237_SEE","FITA ANTICORROSIVA","M",5,null,null,null,"",null,"","","(sem código)","-",0,0]
["S",3,"S",0,1,6,1,0,0,0,0,"","Serviço","Serviço","1.6.1.13.","AGETOP",91025,"VÁLVULA ESFERICA LATÃO 3/4\"","Un    ",3,null,null,null,"",null,"","","(sem código)","-",0,0]
["S",3,"S",0,1,6,1,0,0,0,0,"","Serviço","Serviço","1.6.1.14.","AGETOP",91019,"TE PRETO 90º 3/4\" NPT 300 LBS","Un    ",1,null,null,null,"",null,"","","(sem código)","-",0,0]
["S",3,"S",0,1,6,1,0,0,0,0,"","Serviço","Serviço","1.6.1.15.","COMPOSIÇÃO","COMP 210_SEE","REGULADOR DE 1º ESTÁGIO 60KG/H MODELO AP-40  COM MANÔMETRO","UN ",1,null,null,null,"",null,"","","(sem código)","-",0,0]
["S",3,"S",0,1,6,1,0,0,0,0,"","Serviço","Serviço","1.6.1.16.","AGETOP",85003,"EXTINTOR PO QUIMICO SECO (6 KG) - CAPACIDADE EXTINTORA 20 BC","Un    ",1,null,null,null,"",null,"","","(sem código)","-",0,0]
["S",3,"S",0,1,6,1,0,0,{"$f":"IF(OR($C148=\"S\",$C148=0),0,MATCH(0,OFFSET($D148,1,$C148,ROW($C$333)-ROW($C148)),0))","v":0},{"$f":"IF(OR($C148=\"S\",$C148=0),0,MATCH(OFFSET($D148,0,$C148)+1,OFFSET($D148,1,$C148,ROW($C$333)-ROW($C148)),0))","v":0},"","Serviço","Serviço","1.6.1.17.","COMPOSIÇÃO","COMP 235_SEE","PLACA DE SINALIZAÇÃO EM PVC COD 01 - (300X300) PROIBIDO FUMAR","UN ",2,null,null,null,"",null,"","","(sem código)","-",0,0]
["S",3,"S",0,1,6,1,0,0,0,0,"","Serviço","Serviço","1.6.1.18.","COMPOSIÇÃO","COMP 236_SEE","PLACA DE SINALIZAÇÃO EM PVC COD 06 - (300X300) PERIGO INFLAMÁVEL","UN ",2,null,null,null,"",null,"","","(sem código)","-",0,0]
["S",3,"S",0,1,6,1,0,0,0,0,"","Serviço","Serviço","1.6.1.19.","AGETOP",91043,"BRAÇADEIRA METALICA TIPO \"D\" DIAM. 3/4\"","Un    ",4,null,null,null,"",null,"","","(sem código)","-",0,0]
["S",3,"S",0,1,6,1,0,0,0,0,"","Serviço","Serviço","1.6.1.20.","AGETOP",71863,"PARAFUSO P/BUCHA S-10","Un    ",8,null,null,null,"",null,"","","(sem código)","-",0,0]
["S",3,"S",0,1,6,1,0,0,0,0,"","Serviço","Serviço","1.6.1.21.","AGETOP",70393,"BUCHA DE NYLON S-10","Un    ",8,null,null,null,"",null,"","","(sem código)","-",0,0]
["S",3,"S",0,1,6,1,0,0,0,0,"","Serviço","Serviço","1.6.1.22.","AGETOP",91045,"SUPORTE PARA COLETOR","Un    ",2,null,null,null,"",null,"","","(sem código)","-",0,0]
["S",3,"S",0,1,6,1,0,0,0,0,"","Serviço","Serviço","1.6.1.23.","COMPOSIÇÃO","COMP 045_SEE","LAUDO DE ESTANQUEIDADE","UN ",1,null,null,null,"",null,"","","(sem código)","-",0,0]
["S",3,"S",0,1,6,1,0,0,0,0,"","Serviço","Serviço","1.6.1.24.","COMPOSIÇÃO","COMP 277_SEE","MARCAÇÃO NO PISO - 1X1 M PARA EXTINTOR","M2",1,null,null,null,"",null,"","","(sem código)","-",0,0]
[{"$f":"CHOOSE(1+LOG(1+2*(ORÇAMENTO.Nivel=\"Nível 1\")+4*(ORÇAMENTO.Nivel=\"Nível 2\")+8*(ORÇAMENTO.Nivel=\"Nível 3\")+16*(ORÇAMENTO.Nivel=\"Nível 4\")+32*(ORÇAMENTO.Nivel=\"Serviço\"),2),0,1,2,3,4,\"S\")","v":2},2,2,5,1,7,0,0,0,34,5,"","Nível 2","Nível 2","1.7.",null,null,"ESQUADRIAS METÁLICAS","-",null,null,null,null,"",null,"","","ESQUADRIAS METÁLICAS","-",0,0]
[3,3,3,2,1,7,1,0,0,4,2,"","Nível 3","Nível 3","1.7.1.","SINAPI",null,"WC ACESSÍVEL","-",null,null,null,null,"",null,"","","WC ACESSÍVEL","-",0,0]
["S",3,"S",0,1,7,1,0,0,0,0,"","Serviço","Serviço","1.7.1.1.","AGETOP",180501,"PORTA DE ABRIR EM CHAPA PF-1 C/FERRAGENS","m2    ",3.7800000000000002,null,null,null,"",null,"","","(sem código)","-",0,0]
[3,3,3,2,1,7,2,0,0,2,11,"","Nível 3","Nível 3","1.7.2.","SINAPI",null,"GRELHA","-",null,null,null,null,"",null,"","","GRELHA","-",0,0]
["S",3,"S",0,1,7,2,0,0,0,0,"","Serviço","Serviço","1.7.2.1.","AGETOP",180323,"GRELHA PADRÃO GOINFRA DE FERRO CHATO COM BERÇO (ESPAÇAMENTO ENTRE FACES = 1,5CM - NBR 9050 ACESSIBILIDADE)","m2    ",8.82,null,null,null,"",null,"","","(sem código)","-",0,0]
[{"$f":"CHOOSE(1+LOG(1+2*(ORÇAMENTO.Nivel=\"Nível 1\")+4*(ORÇAMENTO.Nivel=\"Nível 2\")+8*(ORÇAMENTO.Nivel=\"Nível 3\")+16*(ORÇAMENTO.Nivel=\"Nível 4\")+32*(ORÇAMENTO.Nivel=\"Serviço\"),2),0,1,2,3,4,\"S\")","v":2},{"$f":"IF(OR(C161=\"s\",C161=0),OFFSET(B161,-1,0),C161)","v":2},{"$f":"IF(OFFSET(C161,-1,0)=\"L\",1,IF(OFFSET(C161,-1,0)=1,2,IF(OR(A161=\"s\",A161=0),\"S\",IF(AND(OFFSET(C161,-1,0)=2,A161=4),3,IF(AND(OR(OFFSET(C161,-1,0)=\"s\",OFFSET(C161,-1,0)=0),A161<>\"s\",A161>OFFSET(B161,-1,0)),OFFSET(B161,-1,0),A161)))))","v":2},{"$f":"IF(OR(C161=\"S\",C161=0),0,IF(ISERROR(K161),J161,SMALL(J161:K161,1)))","v":13},{"$f":"IF($C161=1,OFFSET(E161,-1,0)+1,OFFSET(E161,-1,0))","v":1},{"$f":"IF($C161=1,0,IF($C161=2,OFFSET(F161,-1,0)+1,OFFSET(F161,-1,0)))","v":8},{"$f":"IF(AND($C161<=2,$C161<>0),0,IF($C161=3,OFFSET(G161,-1,0)+1,OFFSET(G161,-1,0)))","v":0},{"$f":"IF(AND($C161<=3,$C161<>0),0,IF($C161=4,OFFSET(H161,-1,0)+1,OFFSET(H161,-1,0)))","v":0},{"$f":"IF(AND($C161<=4,$C161<>0),0,IF(AND($C161=\"S\",$W161>0),OFFSET(I161,-1,0)+1,OFFSET(I161,-1,0)))","v":0},29,13,{"$f":"IF(OR(W161>0,$C161=1),\"F\",\"\")","v":""},"Nível 2",{"$f":"CHOOSE(1+LOG(1+2*(C161=1)+4*(C161=2)+8*(C161=3)+16*(C161=4)+32*(C161=\"S\"),2),\"\",\"Nível 1\",\"Nível 2\",\"Nível 3\",\"Nível 4\",\"Serviço\")","v":"Nível 2"},"1.8.",null,null,"REVESTIMENTO DE PISO","-",null,null,null,null,"",null,{"$f":"IFERROR(VLOOKUP(Q161,INDIRECT(\"EQUIVALÊNCIAS\"),4,FALSE),\"\")","v":""},{"$f":"IFERROR(VLOOKUP(Q161,INDIRECT(\"EQUIVALÊNCIAS\"),5,FALSE),\"\")","v":""},{"$f":"IFERROR(IF(OR($C161=0,$C161=1,$C161=2,$C161=3,$C161=4),R161,VLOOKUP($AA161,INDIRECT($Z161),2,FALSE)),\"(sem código)\")","v":"REVESTIMENTO DE PISO"},{"$f":"IFERROR(VLOOKUP(AA161,INDIRECT(Z161),3,FALSE()),\"-\")","v":"-"},{"$f":"IFERROR(VLOOKUP($AA161,INDIRECT($Z161),IF($T$11=\"DESONERADA\",4,7),FALSE()),0)","v":0},{"$f":"IFERROR(VLOOKUP($AA161,INDIRECT($Z161),IF($T$11=\"DESONERADA\",5,8),FALSE()),0)","v":0}]
[3,3,3,3,1,8,1,0,0,12,3,"","Nível 3","Nível 3","1.8.1.","SINAPI",null,"ACESSIBILIDADE","-",null,null,null,null,"",null,"","","ACESSIBILIDADE","-",0,0]
["S",3,"S",0,1,8,1,0,0,0,0,"","Serviço","Serviço","1.8.1.1.","AGETOP",221120,"PISO DE BORRACHA COLORIDO MODELO TÁTIL ( ALERTA OU DIRECIONAL) INCLUSO CONTRAPISO (1CI:3ARML) C/ E=2CM E NATA DE CIMENTO","m2    ",7.15,null,null,null,"",null,"","","(sem código)","-",0,0]
["S",3,"S",0,1,8,1,0,0,0,0,"","Serviço","Serviço","1.8.1.2.","AGETOP",221126,"PISO DE LADRILHO HIDRÁULICO COLORIDO MODELO TÁTIL ( ALERTA OU DIRECIONAL) SEM LASTRO","m2    ",141.33000000000001,null,null,null,"",null,"","","(sem código)","-",0,0]
[3,3,3,5,1,8,2,0,0,{"$f":"IF(OR($C165=\"S\",$C165=0),0,MATCH(0,OFFSET($D165,1,$C165,ROW($C$333)-ROW($C165)),0))","v":9},{"$f":"IF(OR($C165=\"S\",$C165=0),0,MATCH(OFFSET($D165,0,$C165)+1,OFFSET($D165,1,$C165,ROW($C$333)-ROW($C165)),0))","v":5},"","Nível 3","Nível 3","1.8.2.","SINAPI",null,"INST. DE INCÊNDIO","-",null,null,null,null,"",null,"","","INST. DE INCÊNDIO","-",0,0]
["S",3,"S",0,1,8,2,0,0,0,0,"","Serviço","Serviço","1.8.2.1.","AGETOP",220102,"PISO CONCRETO DESEMPENADO ESPESSURA = 5 CM  1:2,5:3,5","m2    ",62,null,null,null,"",null,"","","(sem código)","-",0,0]
["S",3,"S",0,1,8,2,0,0,0,0,"","Serviço","Serviço","1.8.2.2.","AGETOP",220101,"LASTRO DE CONCRETO REGULARIZADO IMPERMEABILIZADO 1:3:6 ESP=5CM (BASE)","m2    ",4.8,null,null,null,"",null,"","","(sem código)","-",0,0]
["S",3,"S",0,1,8,2,0,0,0,0,"","Serviço","Serviço","1.8.2.3.","SINAPI",84191,"PISO EM GRANILITE, MARMORITE OU GRANITINA ESPESSURA 8 MM, INCLUSO JUNTAS DE DILATACAO PLASTICAS","M2",4.8,null,null,null,"Referência: AGETOP - 221101","SIM","","","(sem código)","-",0,0]
["S",3,"S",0,1,8,2,0,0,0,0,"","Serviço","Serviço","1.8.2.4.","AGETOP",221104,"RASPAGEM E APLICAÇÃO RESINA ACRÍLICA DUAS DEMÃOS","m2    ",4.8,null,null,null,"",null,"","","(sem código)","-",0,0]
[3,3,3,2,1,8,3,0,0,{"$f":"IF(OR($C170=\"S\",$C170=0),0,MATCH(0,OFFSET($D170,1,$C170,ROW($C$333)-ROW($C170)),0))","v":4},{"$f":"IF(OR($C170=\"S\",$C170=0),0,MATCH(OFFSET($D170,0,$C170)+1,OFFSET($D170,1,$C170,ROW($C$333)-ROW($C170)),0))","v":2},"","Nível 3","Nível 3","1.8.3.","SINAPI",null,"CENTRAL DE GÁS","-",null,null,null,null,"",null,"","","CENTRAL DE GÁS","-",0,0]
["S",3,"S",0,1,8,3,0,0,0,0,"","Serviço","Serviço","1.8.3.1.","AGETOP",220102,"PISO CONCRETO DESEMPENADO ESPESSURA = 5 CM  1:2,5:3,5","m2    ",0.2,null,null,null,"",null,"","","(sem código)","-",0,0]
[3,3,3,2,1,8,4,0,0,2,{"$error":"#N/A"},"","Nível 3","Nível 3","1.8.4.","SINAPI",null,"INST. HIDROSSANITÁRIAS","-",null,null,null,null,"",null,"","","INST. HIDROSSANITÁRIAS","-",0,0]
["S",3,"S",0,1,8,4,0,0,0,0,"","Serviço","Serviço","1.8.4.1.","AGETOP",220102,"PISO CONCRETO DESEMPENADO ESPESSURA = 5 CM  1:2,5:3,5","m2    ",10.5,null,null,null,"",null,"","","(sem código)","-",0,0]
[2,2,2,2,1,9,0,0,0,16,2,"","Nível 2","Nível 2","1.9.","SINAPI",null,"FERRAGENS","-",null,null,null,null,"",null,"","","FERRAGENS","-",0,0]
["S",2,"S",0,1,9,0,0,0,0,0,"","Serviço","Serviço","1.9.0.1.","AGETOP",230174,"BARRA DE APOIO EM AÇO INOX - 40 CM","un    ",2,null,null,null,"",null,"","","(sem código)","-",0,0]
[2,{"$f":"IF(OR(C176=\"s\",C176=0),OFFSET(B176,-1,0),C176)","v":2},{"$f":"IF(OFFSET(C176,-1,0)=\"L\",1,IF(OFFSET(C176,-1,0)=1,2,IF(OR(A176=\"s\",A176=0),\"S\",IF(AND(OFFSET(C176,-1,0)=2,A176=4),3,IF(AND(OR(OFFSET(C176,-1,0)=\"s\",OFFSET(C176,-1,0)=0),A176<>\"s\",A176>OFFSET(B176,-1,0)),OFFSET(B176,-1,0),A176)))))","v":2},{"$f":"IF(OR(C176=\"S\",C176=0),0,IF(ISERROR(K176),J176,SMALL(J176:K176,1)))","v":4},{"$f":"IF($C176=1,OFFSET(E176,-1,0)+1,OFFSET(E176,-1,0))","v":1},{"$f":"IF($C176=1,0,IF($C176=2,OFFSET(F176,-1,0)+1,OFFSET(F176,-1,0)))","v":10},{"$f":"IF(AND($C176<=2,$C176<>0),0,IF($C176=3,OFFSET(G176,-1,0)+1,OFFSET(G176,-1,0)))","v":0},{"$f":"IF(AND($C176<=3,$C176<>0),0,IF($C176=4,OFFSET(H176,-1,0)+1,OFFSET(H176,-1,0)))","v":0},{"$f":"IF(AND($C176<=4,$C176<>0),0,IF(AND($C176=\"S\",$W176>0),OFFSET(I176,-1,0)+1,OFFSET(I176,-1,0)))","v":0},{"$f":"IF(OR($C176=\"S\",$C176=0),0,MATCH(0,OFFSET($D176,1,$C176,ROW($C$333)-ROW($C176)),0))","v":14},{"$f":"IF(OR($C176=\"S\",$C176=0),0,MATCH(OFFSET($D176,0,$C176)+1,OFFSET($D176,1,$C176,ROW($C$333)-ROW($C176)),0))","v":4},{"$f":"IF(OR(W176>0,$C176=1),\"F\",\"\")","v":""},"Nível 2",{"$f":"CHOOSE(1+LOG(1+2*(C176=1)+4*(C176=2)+8*(C176=3)+16*(C176=4)+32*(C176=\"S\"),2),\"\",\"Nível 1\",\"Nível 2\",\"Nível 3\",\"Nível 4\",\"Serviço\")","v":"Nível 2"},"1.10.",null,null,"ADMINISTRAÇÃO","-",null,null,null,null,"",null,{"$f":"IFERROR(VLOOKUP(Q176,INDIRECT(\"EQUIVALÊNCIAS\"),4,FALSE),\"\")","v":""},{"$f":"IFERROR(VLOOKUP(Q176,INDIRECT(\"EQUIVALÊNCIAS\"),5,FALSE),\"\")","v":""},{"$f":"IFERROR(IF(OR($C176=0,$C176=1,$C176=2,$C176=3,$C176=4),R176,VLOOKUP($AA176,INDIRECT($Z176),2,FALSE)),\"(sem código)\")","v":"ADMINISTRAÇÃO"},{"$f":"IFERROR(VLOOKUP(AA176,INDIRECT(Z176),3,FALSE()),\"-\")","v":"-"},{"$f":"IFERROR(VLOOKUP($AA176,INDIRECT($Z176),IF($T$11=\"DESONERADA\",4,7),FALSE()),0)","v":0},{"$f":"IFERROR(VLOOKUP($AA176,INDIRECT($Z176),IF($T$11=\"DESONERADA\",5,8),FALSE()),0)","v":0}]
[3,3,3,3,1,10,1,0,0,3,6,"","Nível 3","Nível 3","1.10.1.",null,null,"MENSALISTAS","-",null,null,null,null,"",null,"","","MENSALISTAS","-",0,0]
["S",3,"S",0,1,10,1,0,0,0,0,"","Serviço","Serviço","1.10.1.1.","SINAPI",90778,"ENGENHEIRO CIVIL DE OBRA PLENO COM ENCARGOS COMPLEMENTARES","H",120,null,null,null,"Referência: AGETOP - 250101","SIM","","","(sem código)","-",0,0]
["S",3,"S",0,1,10,1,0,0,0,0,"","Serviço","Serviço","1.10.1.2.","SINAPI",90776,"ENCARREGADO GERAL COM ENCARGOS COMPLEMENTARES","H",660,null,null,null,"Referência: AGETOP - 250103","SIM","","","(sem código)","-",0,0]
[{"$f":"CHOOSE(1+LOG(1+2*(ORÇAMENTO.Nivel=\"Nível 1\")+4*(ORÇAMENTO.Nivel=\"Nível 2\")+8*(ORÇAMENTO.Nivel=\"Nível 3\")+16*(ORÇAMENTO.Nivel=\"Nível 4\")+32*(ORÇAMENTO.Nivel=\"Serviço\"),2),0,1,2,3,4,\"S\")","v":2},2,2,5,1,11,0,0,0,10,5,"","Nível 2","Nível 2","1.11.",null,null,"PINTURA","-",null,null,null,null,"",null,"","","PINTURA","-",0,0]
[3,3,3,2,1,11,1,0,0,4,2,"","Nível 3","Nível 3","1.11.1.","SINAPI",null,"WC ACESSÍVEL","-",null,null,null,null,"",null,"","","WC ACESSÍVEL","-",0,0]
["S",3,"S",0,1,11,1,0,0,0,0,"","Serviço","Serviço","1.11.1.1.","SINAPI","74145/1","PINTURA ESMALTE FOSCO, DUAS DEMAOS, SOBRE SUPERFICIE METALICA, INCLUSO UMA DEMAO DE FUNDO ANTICORROSIVO. UTILIZACAO DE REVOLVER ( AR-COMPRIMIDO).","M2",11.34,null,null,null,"Referência: AGETOP - 261602","SIM","","","(sem código)","-",0,0]
[3,3,3,2,1,11,2,0,0,2,46,"","Nível 3","Nível 3","1.11.2.","SINAPI",null,"GRELHA","-",null,null,null,null,"",null,"","","GRELHA","-",0,0]
["S",3,"S",0,1,11,2,0,0,0,0,"","Serviço","Serviço","1.11.2.1.","SINAPI","74145/1","PINTURA ESMALTE FOSCO, DUAS DEMAOS, SOBRE SUPERFICIE METALICA, INCLUSO UMA DEMAO DE FUNDO ANTICORROSIVO. UTILIZACAO DE REVOLVER ( AR-COMPRIMIDO).","M2",13.23,null,null,null,"Referência: AGETOP - 261602","SIM","","","(sem código)","-",0,0]
[2,2,2,5,1,12,0,0,0,5,120,"","Nível 2","Nível 2","1.12.",null,null,"DIVERSOS","-",null,null,null,null,"",null,"","","DIVERSOS","-",0,0]
[3,3,3,2,1,12,1,0,0,4,2,"","Nível 3","Nível 3","1.12.1.","SINAPI",null,"GRELHA","-",null,null,null,null,"",null,"","","GRELHA","-",0,0]
["S",3,"S",0,1,12,1,0,0,0,0,"","Serviço","Serviço","1.12.1.1.","AGETOP",271417,"CANALETA CONCRETO DESEMPENADO 5 CM PD.GOINFRA","m     ",22.03,null,null,null,"",null,"","","(sem código)","-",0,0]
[3,3,3,2,1,12,2,0,0,2,41,"","Nível 3","Nível 3","1.12.2.","SINAPI",null,"OUTROS","-",null,null,null,null,"",null,"","","OUTROS","-",0,0]
["S",3,"S",0,1,12,2,0,0,0,0,"","Serviço","Serviço","1.12.2.1.","AGETOP",270501,"LIMPEZA FINAL DE OBRA - (OBRAS CIVIS)","m2    ",85,null,null,null,"",null,"","","(sem código)","-",0,0]
[1,1,1,143,2,0,0,0,0,143,{"$error":"#N/A"},"F","Nível 1","Nível 1","2.","SINAPI",null,"BLOCO 01 SALA DE AULA PADRÃO SEDUC 2017 - LAJE","-",null,null,null,null,"",null,"","","BLOCO 01 SALA DE AULA PADRÃO SEDUC 2017 - LAJE","-",0,0]
[2,2,2,2,2,1,0,0,0,142,2,"","Nível 2","Nível 2","2.1.","SINAPI",null,"SERVIÇOS PRELIMINARES","-",null,null,null,null,"",null,"","","SERVIÇOS PRELIMINARES","-",{"$f":"IFERROR(VLOOKUP($AA191,INDIRECT($Z191),IF($T$11=\"DESONERADA\",4,7),FALSE()),0)","v":0},{"$f":"IFERROR(VLOOKUP($AA191,INDIRECT($Z191),IF($T$11=\"DESONERADA\",5,8),FALSE()),0)","v":0}]
["S",2,"S",0,2,1,0,0,0,0,0,"","Serviço","Serviço","2.1.0.1.","AGETOP",20701,"LOCAÇÃO DA OBRA, EXECUÇÃO DE GABARITO SEM REAPROVEITAMENTO, INCLUSO PINTURA (FACE INTERNA DO RIPÃO 15CM) E PIQUETE COM TESTEMUNHA","m2    ",64.260000000000005,null,null,null,"",null,"","","(sem código)","-",0,0]
[2,{"$f":"IF(OR(C193=\"s\",C193=0),OFFSET(B193,-1,0),C193)","v":2},{"$f":"IF(OFFSET(C193,-1,0)=\"L\",1,IF(OFFSET(C193,-1,0)=1,2,IF(OR(A193=\"s\",A193=0),\"S\",IF(AND(OFFSET(C193,-1,0)=2,A193=4),3,IF(AND(OR(OFFSET(C193,-1,0)=\"s\",OFFSET(C193,-1,0)=0),A193<>\"s\",A193>OFFSET(B193,-1,0)),OFFSET(B193,-1,0),A193)))))","v":2},{"$f":"IF(OR(C193=\"S\",C193=0),0,IF(ISERROR(K193),J193,SMALL(J193:K193,1)))","v":3},{"$f":"IF($C193=1,OFFSET(E193,-1,0)+1,OFFSET(E193,-1,0))","v":2},{"$f":"IF($C193=1,0,IF($C193=2,OFFSET(F193,-1,0)+1,OFFSET(F193,-1,0)))","v":2},{"$f":"IF(AND($C193<=2,$C193<>0),0,IF($C193=3,OFFSET(G193,-1,0)+1,OFFSET(G193,-1,0)))","v":0},{"$f":"IF(AND($C193<=3,$C193<>0),0,IF($C193=4,OFFSET(H193,-1,0)+1,OFFSET(H193,-1,0)))","v":0},{"$f":"IF(AND($C193<=4,$C193<>0),0,IF(AND($C193=\"S\",$W193>0),OFFSET(I193,-1,0)+1,OFFSET(I193,-1,0)))","v":0},140,3,{"$f":"IF(OR(W193>0,$C193=1),\"F\",\"\")","v":""},"Nível 2",{"$f":"CHOOSE(1+LOG(1+2*(C193=1)+4*(C193=2)+8*(C193=3)+16*(C193=4)+32*(C193=\"S\"),2),\"\",\"Nível 1\",\"Nível 2\",\"Nível 3\",\"Nível 4\",\"Serviço\")","v":"Nível 2"},"2.2.","SINAPI",null,"TRANSPORTES","-",null,null,null,null,"",null,{"$f":"IFERROR(VLOOKUP(Q193,INDIRECT(\"EQUIVALÊNCIAS\"),4,FALSE),\"\")","v":""},{"$f":"IFERROR(VLOOKUP(Q193,INDIRECT(\"EQUIVALÊNCIAS\"),5,FALSE),\"\")","v":""},{"$f":"IFERROR(IF(OR($C193=0,$C193=1,$C193=2,$C193=3,$C193=4),R193,VLOOKUP($AA193,INDIRECT($Z193),2,FALSE)),\"(sem código)\")","v":"TRANSPORTES"},{"$f":"IFERROR(VLOOKUP(AA193,INDIRECT(Z193),3,FALSE()),\"-\")","v":"-"},0,0]
["S",2,"S",0,2,2,0,0,0,0,0,"","Serviço","Serviço","2.2.0.1.","SINAPI",72897,"CARGA MANUAL DE ENTULHO EM CAMINHAO BASCULANTE 6 M3","M3",4.49,null,null,null,"","NÃO","","","(sem código)","-",0,0]
["S",2,"S",0,2,2,0,0,0,0,0,"","Serviço","Serviço","2.2.0.2.","SINAPI",72900,"TRANSPORTE DE ENTULHO COM CAMINHAO BASCULANTE 6 M3, RODOVIA PAVIMENTADA, DMT 0,5 A 1,0 KM","M3",4.49,null,null,null,"","NÃO","","","(sem código)","-",0,0]
[2,2,2,6,2,3,0,0,0,137,6,"","Nível 2","Nível 2","2.3.","SINAPI",null,"SERVIÇO EM TERRA","-",null,null,null,null,"",null,"","","SERVIÇO EM TERRA","-",0,0]
[3,3,3,3,2,3,1,0,0,{"$f":"IF(OR($C197=\"S\",$C197=0),0,MATCH(0,OFFSET($D197,1,$C197,ROW($C$333)-ROW($C197)),0))","v":5},{"$f":"IF(OR($C197=\"S\",$C197=0),0,MATCH(OFFSET($D197,0,$C197)+1,OFFSET($D197,1,$C197,ROW($C$333)-ROW($C197)),0))","v":3},"","Nível 3","Nível 3","2.3.1.","SINAPI",null,"IMPLANTAÇÃO","-",null,null,null,null,"",null,"","","IMPLANTAÇÃO","-",0,0]
["S",3,"S",0,2,3,1,0,0,0,0,"","Serviço","Serviço","2.3.1.1.","AGETOP",41140,"REGULARIZAÇÃO DO TERRENO SEM APILOAMENTO COM TRANSPORTE MANUAL DA TERRA ESCAVADA ","m2    ",64.260000000000005,null,null,null,"",null,"","","(sem código)","-",0,0]
["S",3,"S",0,2,3,1,0,0,0,0,"","Serviço","Serviço","2.3.1.2.","AGETOP",41002,"APILOAMENTO","m2    ",64.260000000000005,null,null,null,"",null,"","","(sem código)","-",0,0]
[3,3,3,2,2,3,2,0,0,2,29,"","Nível 3","Nível 3","2.3.2.","SINAPI",null,"SPDA","-",null,null,null,null,"",null,"","","SPDA","-",0,0]
["S",3,"S",0,2,3,2,0,0,0,0,"","Serviço","Serviço","2.3.2.1.","SINAPI",93358,"ESCAVAÇÃO MANUAL DE VALA COM PROFUNDIDADE MENOR OU IGUAL A 1,30 M. AF_03/2016","M3",4.8,null,null,null,"Referência: AGETOP - 40101","SIM","","","(sem código)","-",0,0]
[2,2,2,11,2,4,0,0,0,131,11,"","Nível 2","Nível 2","2.4.","SINAPI",null,"FUNDAÇÕES E SONDAGENS","-",null,null,null,null,"",null,"","","FUNDAÇÕES E SONDAGENS","-",0,0]
[{"$f":"CHOOSE(1+LOG(1+2*(ORÇAMENTO.Nivel=\"Nível 1\")+4*(ORÇAMENTO.Nivel=\"Nível 2\")+8*(ORÇAMENTO.Nivel=\"Nível 3\")+16*(ORÇAMENTO.Nivel=\"Nível 4\")+32*(ORÇAMENTO.Nivel=\"Serviço\"),2),0,1,2,3,4,\"S\")","v":3},3,3,10,2,4,1,0,0,10,20,"","Nível 3","Nível 3","2.4.1.","SINAPI",null,"ESTACAS E BLOCOS","-",null,null,null,null,"",null,"","","ESTACAS E BLOCOS","-",0,0]
["S",3,"S",0,2,4,1,0,0,0,0,"","Serviço","Serviço","2.4.1.1.","SINAPI",98230,"ESTACA BROCA DE CONCRETO, DIÂMETRO DE 30 CM, PROFUNDIDADE DE ATÉ 3 M, ESCAVAÇÃO MANUAL COM TRADO CONCHA, NÃO ARMADA. AF_03/2018","M",41.5,null,null,null,"Referência: AGETOP - 50302","SIM","","","(sem código)","-",0,0]
["S",3,"S",0,2,4,1,0,0,0,0,"","Serviço","Serviço","2.4.1.2.","SINAPI",96522,"ESCAVAÇÃO MANUAL PARA BLOCO DE COROAMENTO OU SAPATA, SEM PREVISÃO DE FÔRMA. AF_06/2017","M3",3.26,null,null,null,"Referência: AGETOP - 50901","SIM","","","(sem código)","-",0,0]
["S",3,"S",0,2,4,1,0,0,0,0,"","Serviço","Serviço","2.4.1.3.","SINAPI",96995,"REATERRO MANUAL APILOADO COM SOQUETE. AF_10/2017","M3",1.8899999999999997,null,null,null,"Referência: AGETOP - 40902","SIM","","","(sem código)","-",0,0]
["S",3,"S",0,2,4,1,0,0,0,0,"","Serviço","Serviço","2.4.1.4.","SINAPI",94963,"CONCRETO FCK = 15MPA, TRAÇO 1:3,4:3,5 (CIMENTO/ AREIA MÉDIA/ BRITA 1)  - PREPARO MECÂNICO COM BETONEIRA 400 L. AF_07/2016","M3",1.37,null,null,null,"","NÃO","","","(sem código)","-",0,0]
["S",3,"S",0,2,4,1,0,0,0,0,"","Serviço","Serviço","2.4.1.5.","SINAPI","74157/4","LANCAMENTO/APLICACAO MANUAL DE CONCRETO EM FUNDACOES","M3",1.37,null,null,null,"Referência: AGETOP - 51026","SIM","","","(sem código)","-",0,0]
["S",3,"S",0,2,4,1,0,0,0,0,"","Serviço","Serviço","2.4.1.6.","SINAPI",96544,"ARMAÇÃO DE BLOCO, VIGA BALDRAME OU SAPATA UTILIZANDO AÇO CA-50 DE 6,3 MM - MONTAGEM. AF_06/2017","KG",19.09,null,null,null,"Referência: AGETOP - 52003","SIM","","","(sem código)","-",0,0]
["S",3,"S",0,2,4,1,0,0,0,0,"","Serviço","Serviço","2.4.1.7.","SINAPI",96545,"ARMAÇÃO DE BLOCO, VIGA BALDRAME OU SAPATA UTILIZANDO AÇO CA-50 DE 8 MM - MONTAGEM. AF_06/2017","KG",54.54,null,null,null,"Referência: AGETOP - 52004","SIM","","","(sem código)","-",0,0]
["S",3,"S",0,2,4,1,0,0,0,0,"","Serviço","Serviço","2.4.1.8.","SINAPI",96546,"ARMAÇÃO DE BLOCO, VIGA BALDRAME OU SAPATA UTILIZANDO AÇO CA-50 DE 10 MM - MONTAGEM. AF_06/2017","KG",34.54,null,null,null,"Referência: AGETOP - 52005","SIM","","","(sem código)","-",0,0]
["S",3,"S",0,2,4,1,0,0,0,0,"","Serviço","Serviço","2.4.1.9.","SINAPI",96543,"ARMAÇÃO DE BLOCO, VIGA BALDRAME E SAPATA UTILIZANDO AÇO CA-60 DE 5 MM - MONTAGEM. AF_06/2017","KG",15.45,null,null,null,"Referência: AGETOP - 52014","SIM","","","(sem código)","-",0,0]
[2,2,2,26,2,5,0,0,0,120,26,"","Nível 2","Nível 2","2.5.","SINAPI",null,"ESTRUTURA","-",null,null,null,null,"",null,"","","ESTRUTURA","-",0,0]
[3,3,3,9,2,5,1,0,0,25,9,"","Nível 3","Nível 3","2.5.1.","SINAPI",null,"VIGAS BALDRAMES","-",null,null,null,null,"",null,"","","VIGAS BALDRAMES","-",0,0]
["S",3,"S",0,2,5,1,0,0,0,0,"","Serviço","Serviço","2.5.1.1.","SINAPI",96527,"ESCAVAÇÃO MANUAL DE VALA PARA VIGA BALDRAME, COM PREVISÃO DE FÔRMA. AF_06/2017","M3",4.22,null,null,null,"Referência: AGETOP - 40101","SIM","","","(sem código)","-",0,0]
["S",3,"S",0,2,5,1,0,0,0,0,"","Serviço","Serviço","2.5.1.2.","SINAPI",96995,"REATERRO MANUAL APILOADO COM SOQUETE. AF_10/2017","M3",2.4799999999999995,null,null,null,"Referência: AGETOP - 40902","SIM","","","(sem código)","-",0,0]
["S",3,"S",0,2,5,1,0,0,0,0,"","Serviço","Serviço","2.5.1.3.","AGETOP",60191,"FORMA DE TABUA CINTA BALDRAME U=8 VEZES","m2    ",24.85,null,null,null,"",null,"","","(sem código)","-",0,0]
["S",3,"S",0,2,5,1,0,0,0,0,"","Serviço","Serviço","2.5.1.4.","SINAPI",94963,"CONCRETO FCK = 15MPA, TRAÇO 1:3,4:3,5 (CIMENTO/ AREIA MÉDIA/ BRITA 1)  - PREPARO MECÂNICO COM BETONEIRA 400 L. AF_07/2016","M3",1.74,null,null,null,"","NÃO","","","(sem código)","-",0,0]
["S",3,"S",0,2,5,1,0,0,0,0,"","Serviço","Serviço","2.5.1.5.","SINAPI","74157/4","LANCAMENTO/APLICACAO MANUAL DE CONCRETO EM FUNDACOES","M3",1.74,null,null,null,"Referência: AGETOP - 51026","SIM","","","(sem código)","-",0,0]
["S",3,"S",0,2,5,1,0,0,0,0,"","Serviço","Serviço","2.5.1.6.","SINAPI",96545,"ARMAÇÃO DE BLOCO, VIGA BALDRAME OU SAPATA UTILIZANDO AÇO CA-50 DE 8 MM - MONTAGEM. AF_06/2017","KG",51.81,null,null,null,"Referência: AGETOP - 52004","SIM","","","(sem código)","-",0,0]
["S",3,"S",0,2,5,1,0,0,0,0,"","Serviço","Serviço","2.5.1.7.","SINAPI",96546,"ARMAÇÃO DE BLOCO, VIGA BALDRAME OU SAPATA UTILIZANDO AÇO CA-50 DE 10 MM - MONTAGEM. AF_06/2017","KG",24.54,null,null,null,"Referência: AGETOP - 52005","SIM","","","(sem código)","-",0,0]
["S",3,"S",0,2,5,1,0,0,0,0,"","Serviço","Serviço","2.5.1.8.","SINAPI",96543,"ARMAÇÃO DE BLOCO, VIGA BALDRAME E SAPATA UTILIZANDO AÇO CA-60 DE 5 MM - MONTAGEM. AF_06/2017","KG",40,null,null,null,"Referência: AGETOP - 52014","SIM","","","(sem código)","-",0,0]
[3,3,3,6,2,5,2,0,0,16,6,"","Nível 3","Nível 3","2.5.2.","SINAPI",null,"PILARES","-",null,null,null,null,"",null,"","","PILARES","-",0,0]
["S",3,"S",0,2,5,2,0,0,0,0,"","Serviço","Serviço","2.5.2.1.","SINAPI",92426,"MONTAGEM E DESMONTAGEM DE FÔRMA DE PILARES RETANGULARES E ESTRUTURAS SIMILARES COM ÁREA MÉDIA DAS SEÇÕES MENOR OU IGUAL A 0,25 M², PÉ-DIREITO SIMPLES, EM CHAPA DE MADEIRA COMPENSADA RESINADA, 8 UTILIZAÇÕES. AF_12/2015","M2",16.37,null,null,null,"","NÃO","","","(sem código)","-",0,0]
["S",3,"S",0,2,5,2,0,0,0,0,"","Serviço","Serviço","2.5.2.2.","SINAPI",94964,"CONCRETO FCK = 20MPA, TRAÇO 1:2,7:3 (CIMENTO/ AREIA MÉDIA/ BRITA 1)  - PREPARO MECÂNICO COM BETONEIRA 400 L. AF_07/2016","M3",0.79,null,null,null,"","NÃO","","","(sem código)","-",0,0]
["S",3,"S",0,2,5,2,0,0,0,0,"","Serviço","Serviço","2.5.2.3.","SINAPI",92873,"LANÇAMENTO COM USO DE BALDES, ADENSAMENTO E ACABAMENTO DE CONCRETO EM ESTRUTURAS. AF_12/2015","M3",0.79,null,null,null,"Referência: AGETOP - 60801","SIM","","","(sem código)","-",0,0]
["S",3,"S",0,2,5,2,0,0,0,0,"","Serviço","Serviço","2.5.2.4.","SINAPI",92778,"ARMAÇÃO DE PILAR OU VIGA DE UMA ESTRUTURA CONVENCIONAL DE CONCRETO ARMADO EM UMA EDIFICAÇÃO TÉRREA OU SOBRADO UTILIZANDO AÇO CA-50 DE 10,0 MM - MONTAGEM. AF_12/2015","KG",52,null,null,null,"Referência: AGETOP - 60305","SIM","","","(sem código)","-",0,0]
["S",3,"S",0,2,5,2,0,0,0,0,"","Serviço","Serviço","2.5.2.5.","SINAPI",92775,"ARMAÇÃO DE PILAR OU VIGA DE UMA ESTRUTURA CONVENCIONAL DE CONCRETO ARMADO EM UMA EDIFICAÇÃO TÉRREA OU SOBRADO UTILIZANDO AÇO CA-60 DE 5,0 MM - MONTAGEM. AF_12/2015","KG",21.81,null,null,null,"Referência: AGETOP - 60314","SIM","","","(sem código)","-",0,0]
[3,3,3,8,2,5,3,0,0,10,8,"","Nível 3","Nível 3","2.5.3.","SINAPI",null,"VIGAS DE COBERTURA","-",null,null,null,null,"",null,"","","VIGAS DE COBERTURA","-",0,0]
["S",3,"S",0,2,5,3,0,0,0,0,"","Serviço","Serviço","2.5.3.1.","SINAPI",92464,"MONTAGEM E DESMONTAGEM DE FÔRMA DE VIGA, ESCORAMENTO METÁLICO, PÉ-DIREITO SIMPLES, EM CHAPA DE MADEIRA RESINADA, 8 UTILIZAÇÕES. AF_12/2015","M2",27.32,null,null,null,"Referência: AGETOP - 60209","SIM","","","(sem código)","-",0,0]
["S",3,"S",0,2,5,3,0,0,0,0,"","Serviço","Serviço","2.5.3.2.","SINAPI",94964,"CONCRETO FCK = 20MPA, TRAÇO 1:2,7:3 (CIMENTO/ AREIA MÉDIA/ BRITA 1)  - PREPARO MECÂNICO COM BETONEIRA 400 L. AF_07/2016","M3",1.63,null,null,null,"","NÃO","","","(sem código)","-",0,0]
["S",3,"S",0,2,5,3,0,0,0,0,"","Serviço","Serviço","2.5.3.3.","SINAPI",92873,"LANÇAMENTO COM USO DE BALDES, ADENSAMENTO E ACABAMENTO DE CONCRETO EM ESTRUTURAS. AF_12/2015","M3",1.63,null,null,null,"Referência: AGETOP - 60801","SIM","","","(sem código)","-",0,0]
["S",3,"S",0,2,5,3,0,0,0,0,"","Serviço","Serviço","2.5.3.4.","SINAPI",92777,"ARMAÇÃO DE PILAR OU VIGA DE UMA ESTRUTURA CONVENCIONAL DE CONCRETO ARMADO EM UMA EDIFICAÇÃO TÉRREA OU SOBRADO UTILIZANDO AÇO CA-50 DE 8,0 MM - MONTAGEM. AF_12/2015","KG",5.45,null,null,null,"Referência: AGETOP - 60304","SIM","","","(sem código)","-",0,0]
["S",3,"S",0,2,5,3,0,0,0,0,"","Serviço","Serviço","2.5.3.5.","SINAPI",92778,"ARMAÇÃO DE PILAR OU VIGA DE UMA ESTRUTURA CONVENCIONAL DE CONCRETO ARMADO EM UMA EDIFICAÇÃO TÉRREA OU SOBRADO UTILIZANDO AÇO CA-50 DE 10,0 MM - MONTAGEM. AF_12/2015","KG",76.36,null,null,null,"Referência: AGETOP - 60305","SIM","","","(sem código)","-",0,0]
[{"$f":"CHOOSE(1+LOG(1+2*(ORÇAMENTO.Nivel=\"Nível 1\")+4*(ORÇAMENTO.Nivel=\"Nível 2\")+8*(ORÇAMENTO.Nivel=\"Nível 3\")+16*(ORÇAMENTO.Nivel=\"Nível 4\")+32*(ORÇAMENTO.Nivel=\"Serviço\"),2),0,1,2,3,4,\"S\")","v":"S"},3,"S",0,2,5,3,0,0,0,0,"","Serviço","Serviço","2.5.3.6.","SINAPI",92779,"ARMAÇÃO DE PILAR OU VIGA DE UMA ESTRUTURA CONVENCIONAL DE CONCRETO ARMADO EM UMA EDIFICAÇÃO TÉRREA OU SOBRADO UTILIZANDO AÇO CA-50 DE 12,5 MM - MONTAGEM. AF_12/2015","KG",19.09,null,null,null,"","NÃO","","","(sem código)","-",0,0]
["S",3,"S",0,2,5,3,0,0,{"$f":"IF(OR($C236=\"S\",$C236=0),0,MATCH(0,OFFSET($D236,1,$C236,ROW($C$333)-ROW($C236)),0))","v":0},{"$f":"IF(OR($C236=\"S\",$C236=0),0,MATCH(OFFSET($D236,0,$C236)+1,OFFSET($D236,1,$C236,ROW($C$333)-ROW($C236)),0))","v":0},"","Serviço","Serviço","2.5.3.7.","SINAPI",92775,"ARMAÇÃO DE PILAR OU VIGA DE UMA ESTRUTURA CONVENCIONAL DE CONCRETO ARMADO EM UMA EDIFICAÇÃO TÉRREA OU SOBRADO UTILIZANDO AÇO CA-60 DE 5,0 MM - MONTAGEM. AF_12/2015","KG",27.27,null,null,null,"Referência: AGETOP - 60314","SIM","","","(sem código)","-",0,0]
[3,3,3,2,2,5,4,0,0,2,{"$error":"#N/A"},"","Nível 3","Nível 3","2.5.4.","SINAPI",null,"LAJE","-",null,null,null,null,"",null,"","","LAJE","-",0,0]
["S",3,"S",0,2,5,4,0,0,0,0,"","Serviço","Serviço","2.5.4.1.","SINAPI","74202/1","LAJE PRE-MOLDADA P/FORRO, SOBRECARGA 100KG/M2, VAOS ATE 3,50M/E=8CM, C/LAJOTAS E CAP.C/CONC FCK=20MPA, 3CM, INTER-EIXO 38CM, C/ESCORAMENTO (REAPR.3X) E FERRAGEM NEGATIVA","M2",52.64,null,null,null,"","NÃO","","","(sem código)","-",0,0]
[2,2,2,42,2,6,0,0,0,94,42,"","Nível 2","Nível 2","2.6.","SINAPI",null,"INSTALAÇÕES ELÉTRICAS","-",null,null,null,null,"",null,"","","INSTALAÇÕES ELÉTRICAS","-",0,0]
[3,3,3,26,2,6,1,0,0,41,26,"","Nível 3","Nível 3","2.6.1.","SINAPI",null,"SISTEMA ELÉTRICO PREDIAL","-",null,null,null,null,"",null,"","","SISTEMA ELÉTRICO PREDIAL","-",0,0]
["S",3,"S",0,2,6,1,0,0,0,0,"","Serviço","Serviço","2.6.1.1.","AGETOP",70351,"BRACADEIRA METALICA TIPO \"U\" DIAM. 3/4\"","Un    ",25,null,null,null,"",null,"","","(sem código)","-",0,0]
["S",3,"S",0,2,6,1,0,0,0,0,"","Serviço","Serviço","2.6.1.2.","AGETOP",70421,"BUCHA E ARRUELA METALICA DIAM. 3/4\"","PR    ",2,null,null,null,"",null,"","","(sem código)","-",0,0]
["S",3,"S",0,2,6,1,0,0,0,0,"","Serviço","Serviço","2.6.1.3.","SINAPI",92980,"CABO DE COBRE FLEXÍVEL ISOLADO, 10 MM², ANTI-CHAMA 0,6/1,0 KV, PARA DISTRIBUIÇÃO - FORNECIMENTO E INSTALAÇÃO. AF_12/2015","M",1,null,null,null,"","NÃO","","","(sem código)","-",0,0]
["S",3,"S",0,2,6,1,0,0,0,0,"","Serviço","Serviço","2.6.1.4.","AGETOP",70561,"CABO ISOLADO PP 3 X 2,5 MM2","M     ",30,null,null,null,"",null,"","","(sem código)","-",0,0]
["S",3,"S",0,2,6,1,0,0,0,0,"","Serviço","Serviço","2.6.1.5.","SINAPI",91926,"CABO DE COBRE FLEXÍVEL ISOLADO, 2,5 MM², ANTI-CHAMA 450/750 V, PARA CIRCUITOS TERMINAIS - FORNECIMENTO E INSTALAÇÃO. AF_12/2015","M",130,null,null,null,"Referência: AGETOP - 70563","SIM","","","(sem código)","-",0,0]
["S",3,"S",0,2,6,1,0,0,0,0,"","Serviço","Serviço","2.6.1.6.","SINAPI",91928,"CABO DE COBRE FLEXÍVEL ISOLADO, 4 MM², ANTI-CHAMA 450/750 V, PARA CIRCUITOS TERMINAIS - FORNECIMENTO E INSTALAÇÃO. AF_12/2015","M",70,null,null,null,"Referência: AGETOP - 70564","SIM","","","(sem código)","-",0,0]
["S",3,"S",0,2,6,1,0,0,0,0,"","Serviço","Serviço","2.6.1.7.","SINAPI",91937,"CAIXA OCTOGONAL 3\" X 3\", PVC, INSTALADA EM LAJE - FORNECIMENTO E INSTALAÇÃO. AF_12/2015","UN",7,null,null,null,"",null,"","","(sem código)","-",0,0]
["S",3,"S",0,2,6,1,0,0,0,0,"","Serviço","Serviço","2.6.1.8.","SINAPI",92868,"CAIXA RETANGULAR 4\" X 2\" MÉDIA (1,30 M DO PISO), METÁLICA, INSTALADA EM PAREDE - FORNECIMENTO E INSTALAÇÃO. AF_12/2015","UN",7,null,null,null,"Referência: AGETOP - 70691","SIM","","","(sem código)","-",0,0]
["S",3,"S",0,2,6,1,0,0,0,0,"","Serviço","Serviço","2.6.1.9.","AGETOP",70924,"CONDULETE DE PVC - CAIXA COM 5 ENTRADAS ","un    ",6,null,null,null,"",null,"","","(sem código)","-",0,0]
["S",3,"S",0,2,6,1,0,0,0,0,"","Serviço","Serviço","2.6.1.10.","SINAPI",91902,"CURVA 90 GRAUS PARA ELETRODUTO, PVC, ROSCÁVEL, DN 25 MM (3/4\"), PARA CIRCUITOS TERMINAIS, INSTALADA EM LAJE - FORNECIMENTO E INSTALAÇÃO. AF_12/2015","UN",3,null,null,null,"Referência: AGETOP - 71141","SIM","","","(sem código)","-",0,0]
["S",3,"S",0,2,6,1,0,0,0,0,"","Serviço","Serviço","2.6.1.11.","SINAPI",91905,"CURVA 90 GRAUS PARA ELETRODUTO, PVC, ROSCÁVEL, DN 32 MM (1\"), PARA CIRCUITOS TERMINAIS, INSTALADA EM LAJE - FORNECIMENTO E INSTALAÇÃO. AF_12/2015","UN",2,null,null,null,"Referência: AGETOP - 71142","SIM","","","(sem código)","-",0,0]
["S",3,"S",0,2,6,1,0,0,0,0,"","Serviço","Serviço","2.6.1.12.","SINAPI",93654,"DISJUNTOR MONOPOLAR TIPO DIN, CORRENTE NOMINAL DE 16A - FORNECIMENTO E INSTALAÇÃO. AF_04/2016","UN",3,null,null,null,"","NÃO","","","(sem código)","-",0,0]
["S",3,"S",0,2,6,1,0,0,0,0,"","Serviço","Serviço","2.6.1.13.","SINAPI",93656,"DISJUNTOR MONOPOLAR TIPO DIN, CORRENTE NOMINAL DE 25A - FORNECIMENTO E INSTALAÇÃO. AF_04/2016","UN",2,null,null,null,"","NÃO","","","(sem código)","-",0,0]
["S",3,"S",0,2,6,1,0,0,0,0,"","Serviço","Serviço","2.6.1.14.","SINAPI",93671,"DISJUNTOR TRIPOLAR TIPO DIN, CORRENTE NOMINAL DE 32A - FORNECIMENTO E INSTALAÇÃO. AF_04/2016","UN",1,null,null,null,"Referência: AGETOP - 71173","SIM","","","(sem código)","-",0,0]
["S",3,"S",0,2,6,1,0,0,0,0,"","Serviço","Serviço","2.6.1.15.","SINAPI",91844,"ELETRODUTO FLEXÍVEL CORRUGADO, PVC, DN 25 MM (3/4\"), PARA CIRCUITOS TERMINAIS, INSTALADO EM LAJE - FORNECIMENTO E INSTALAÇÃO. AF_12/2015","M",50,null,null,null,"","NÃO","","","(sem código)","-",{"$f":"IFERROR(VLOOKUP($AA255,INDIRECT($Z255),IF($T$11=\"DESONERADA\",4,7),FALSE()),0)","v":0},{"$f":"IFERROR(VLOOKUP($AA255,INDIRECT($Z255),IF($T$11=\"DESONERADA\",5,8),FALSE()),0)","v":0}]
["S",3,"S",0,2,6,1,0,0,0,0,"","Serviço","Serviço","2.6.1.16.","SINAPI",91871,"ELETRODUTO RÍGIDO ROSCÁVEL, PVC, DN 25 MM (3/4\"), PARA CIRCUITOS TERMINAIS, INSTALADO EM PAREDE - FORNECIMENTO E INSTALAÇÃO. AF_12/2015","M",10,null,null,null,"Referência: AGETOP - 71201","SIM","","","(sem código)","-",0,0]
["S",{"$f":"IF(OR(C257=\"s\",C257=0),OFFSET(B257,-1,0),C257)","v":3},{"$f":"IF(OFFSET(C257,-1,0)=\"L\",1,IF(OFFSET(C257,-1,0)=1,2,IF(OR(A257=\"s\",A257=0),\"S\",IF(AND(OFFSET(C257,-1,0)=2,A257=4),3,IF(AND(OR(OFFSET(C257,-1,0)=\"s\",OFFSET(C257,-1,0)=0),A257<>\"s\",A257>OFFSET(B257,-1,0)),OFFSET(B257,-1,0),A257)))))","v":"S"},{"$f":"IF(OR(C257=\"S\",C257=0),0,IF(ISERROR(K257),J257,SMALL(J257:K257,1)))","v":0},{"$f":"IF($C257=1,OFFSET(E257,-1,0)+1,OFFSET(E257,-1,0))","v":2},{"$f":"IF($C257=1,0,IF($C257=2,OFFSET(F257,-1,0)+1,OFFSET(F257,-1,0)))","v":6},{"$f":"IF(AND($C257<=2,$C257<>0),0,IF($C257=3,OFFSET(G257,-1,0)+1,OFFSET(G257,-1,0)))","v":1},{"$f":"IF(AND($C257<=3,$C257<>0),0,IF($C257=4,OFFSET(H257,-1,0)+1,OFFSET(H257,-1,0)))","v":0},{"$f":"IF(AND($C257<=4,$C257<>0),0,IF(AND($C257=\"S\",$W257>0),OFFSET(I257,-1,0)+1,OFFSET(I257,-1,0)))","v":0},0,0,{"$f":"IF(OR(W257>0,$C257=1),\"F\",\"\")","v":""},"Serviço",{"$f":"CHOOSE(1+LOG(1+2*(C257=1)+4*(C257=2)+8*(C257=3)+16*(C257=4)+32*(C257=\"S\"),2),\"\",\"Nível 1\",\"Nível 2\",\"Nível 3\",\"Nível 4\",\"Serviço\")","v":"Serviço"},"2.6.1.17.","SINAPI",91953,"INTERRUPTOR SIMPLES (1 MÓDULO), 10A/250V, INCLUINDO SUPORTE E PLACA - FORNECIMENTO E INSTALAÇÃO. AF_12/2015","UN",2,null,null,null,"Referência: AGETOP - 71440","SIM",{"$f":"IFERROR(VLOOKUP(Q257,INDIRECT(\"EQUIVALÊNCIAS\"),4,FALSE),\"\")","v":""},{"$f":"IFERROR(VLOOKUP(Q257,INDIRECT(\"EQUIVALÊNCIAS\"),5,FALSE),\"\")","v":""},{"$f":"IFERROR(IF(OR($C257=0,$C257=1,$C257=2,$C257=3,$C257=4),R257,VLOOKUP($AA257,INDIRECT($Z257),2,FALSE)),\"(sem código)\")","v":"(sem código)"},{"$f":"IFERROR(VLOOKUP(AA257,INDIRECT(Z257),3,FALSE()),\"-\")","v":"-"},0,0]
["S",3,"S",0,2,6,1,0,0,0,0,"","Serviço","Serviço","2.6.1.18.","COMPOSIÇÃO","COMP 387_SEE","LÂMPADA LED TUBULAR 18W ","UN ",14,null,null,null,"",null,"","","(sem código)","-",0,0]
["S",3,"S",0,2,6,1,0,0,0,0,"","Serviço","Serviço","2.6.1.19.","SINAPI",97585,"LUMINÁRIA TIPO CALHA, DE SOBREPOR, COM 2 LÂMPADAS TUBULARES DE 18 W - FORNECIMENTO E INSTALAÇÃO. AF_11/2017","UN",7,null,null,null,"",null,"","","(sem código)","-",0,0]
["S",3,"S",0,2,6,1,0,0,0,0,"","Serviço","Serviço","2.6.1.20.","SINAPI",91884,"LUVA PARA ELETRODUTO, PVC, ROSCÁVEL, DN 25 MM (3/4\"), PARA CIRCUITOS TERMINAIS, INSTALADA EM PAREDE - FORNECIMENTO E INSTALAÇÃO. AF_12/2015","UN",25,null,null,null,"Referência: AGETOP - 71741","SIM","","","(sem código)","-",0,0]
["S",3,"S",0,2,6,1,0,0,0,0,"","Serviço","Serviço","2.6.1.21.","SINAPI",91885,"LUVA PARA ELETRODUTO, PVC, ROSCÁVEL, DN 32 MM (1\"), PARA CIRCUITOS TERMINAIS, INSTALADA EM PAREDE - FORNECIMENTO E INSTALAÇÃO. AF_12/2015","UN",25,null,null,null,"Referência: AGETOP - 71742","SIM","","","(sem código)","-",0,0]
["S",3,"S",0,2,6,1,0,0,0,0,"","Serviço","Serviço","2.6.1.22.","AGETOP",72170,"QUADRO DE DISTRIBUIÇÃO DE EMBUTIR EM PVC CB 12E - 80A","Un    ",1,null,null,null,"",null,"","","(sem código)","-",0,0]
["S",3,"S",0,2,6,1,0,0,0,0,"","Serviço","Serviço","2.6.1.23.","AGETOP",72385,"TAMPA CEGA PARA CONDULETE DE PVC","Un    ",6,null,null,null,"",null,"","","(sem código)","-",0,0]
["S",3,"S",0,2,6,1,0,0,0,0,"","Serviço","Serviço","2.6.1.24.","SINAPI",92000,"TOMADA BAIXA DE EMBUTIR (1 MÓDULO), 2P+T 10 A, INCLUINDO SUPORTE E PLACA - FORNECIMENTO E INSTALAÇÃO. AF_12/2015","UN",3,null,null,null,"Referência: AGETOP - 72578","SIM","","","(sem código)","-",0,0]
["S",3,"S",0,2,6,1,0,0,0,0,"","Serviço","Serviço","2.6.1.25.","SINAPI",91993,"TOMADA ALTA DE EMBUTIR (1 MÓDULO), 2P+T 20 A, INCLUINDO SUPORTE E PLACA - FORNECIMENTO E INSTALAÇÃO. AF_12/2015","UN",2,null,null,null,"Referência: AGETOP - 72585","SIM","","","(sem código)","-",0,0]
[3,3,3,15,2,6,2,0,0,15,{"$error":"#N/A"},"","Nível 3","Nível 3","2.6.2.","SINAPI",null,"SPDA","-",null,null,null,null,"",null,"","","SPDA","-",0,0]
[{"$f":"CHOOSE(1+LOG(1+2*(ORÇAMENTO.Nivel=\"Nível 1\")+4*(ORÇAMENTO.Nivel=\"Nível 2\")+8*(ORÇAMENTO.Nivel=\"Nível 3\")+16*(ORÇAMENTO.Nivel=\"Nível 4\")+32*(ORÇAMENTO.Nivel=\"Serviço\"),2),0,1,2,3,4,\"S\")","v":"S"},3,"S",0,2,6,2,0,0,0,0,"","Serviço","Serviço","2.6.2.1.","SINAPI",72315,"TERMINAL AEREO EM ACO GALVANIZADO COM BASE DE FIXACAO H = 30CM","UN",6,null,null,null,"",null,"","","(sem código)","-",0,0]
["S",3,"S",0,2,6,2,0,0,0,0,"","Serviço","Serviço","2.6.2.2.","COMPOSIÇÃO","COMP 036_SEE","PRESILHA LATÃO 16/35MM 5MM+PARAF FENDA ","UN ",70,null,null,null,"",null,"","","(sem código)","-",0,0]
["S",3,"S",0,2,6,2,0,0,0,0,"","Serviço","Serviço","2.6.2.3.","SINAPI",93203,"FIXAÇÃO (ENCUNHAMENTO) DE ALVENARIA DE VEDAÇÃO COM ESPUMA DE POLIURETANO EXPANSIVA. AF_03/2016","M",1,null,null,null,"",null,"","","(sem código)","-",0,0]
["S",3,"S",0,2,6,2,0,0,0,0,"","Serviço","Serviço","2.6.2.4.","AGETOP",71035,"CONECTOR TIPO PARAFUSO FENDIDO 35 MM2","Un    ",15,null,null,null,"",null,"","","(sem código)","-",0,0]
["S",3,"S",0,2,6,2,0,0,0,0,"","Serviço","Serviço","2.6.2.5.","AGETOP",70543,"CABO DE COBRE NÚ No. 35 MM2","M     ",57,null,null,null,"",null,"","","(sem código)","-",0,0]
["S",3,"S",0,2,6,2,0,0,0,0,"","Serviço","Serviço","2.6.2.6.","AGETOP",70544,"CABO DE COBRE NÚ No. 50 MM2","M     ",42,null,null,null,"",null,"","","(sem código)","-",0,0]
["S",3,"S",0,2,6,2,0,0,0,0,"","Serviço","Serviço","2.6.2.7.","SINAPI",91872,"ELETRODUTO RÍGIDO ROSCÁVEL, PVC, DN 32 MM (1\"), PARA CIRCUITOS TERMINAIS, INSTALADO EM PAREDE - FORNECIMENTO E INSTALAÇÃO. AF_12/2015","M",14.52,null,null,null,"Referência: AGETOP - 71202","SIM","","","(sem código)","-",0,0]
["S",3,"S",0,2,6,2,0,0,0,0,"","Serviço","Serviço","2.6.2.8.","AGETOP",70372,"BRACADEIRA METALICA TIPO \"D\" DIAM. 1\"","Un    ",7.26,null,null,null,"",null,"","","(sem código)","-",0,0]
["S",3,"S",0,2,6,2,0,0,0,0,"","Serviço","Serviço","2.6.2.9.","SINAPI",96985,"HASTE DE ATERRAMENTO 5/8  PARA SPDA - FORNECIMENTO E INSTALAÇÃO. AF_12/2017","UN",4,null,null,null,"",null,"","","(sem código)","-",0,0]
["S",3,"S",0,2,6,2,0,0,0,0,"","Serviço","Serviço","2.6.2.10.","SINAPI",98111,"CAIXA DE INSPEÇÃO PARA ATERRAMENTO, CIRCULAR, EM POLIETILENO, DIÂMETRO INTERNO = 0,3 M. AF_05/2018","UN",1,null,null,null,"",null,"","","(sem código)","-",0,0]
["S",3,"S",0,2,6,2,0,0,0,0,"","Serviço","Serviço","2.6.2.11.","AGETOP",70255,"ATERRAMENTO - SOLDA EXOTÉRMICA - CARTUCHO 90 G","un    ",4,null,null,null,"",null,"","","(sem código)","-",0,0]
["S",3,"S",0,2,6,2,0,0,0,0,"","Serviço","Serviço","2.6.2.12.","COMPOSIÇÃO","COMP 039_SEE","MOLDE GRAF CGT 5/8 50MM C","UN ",1,null,null,null,"",null,"","","(sem código)","-",0,0]
["S",3,"S",0,2,6,2,0,0,0,0,"","Serviço","Serviço","2.6.2.13.","COMPOSIÇÃO","COMP 550_SEE","ALIC P/MOLDE C-84","UN ",1,null,null,null,"",null,"","","(sem código)","-",0,0]
["S",3,"S",0,2,6,2,0,0,0,0,"","Serviço","Serviço","2.6.2.14.","COMPOSIÇÃO","COMP 048_SEE","HASTE ROSQUEADA \"TIRANTE\" 3/8\"","M",5,null,null,null,"",null,"","","(sem código)","-",0,0]
[2,2,2,8,2,7,0,0,0,52,8,"","Nível 2","Nível 2","2.7.","SINAPI",null,"INSTALAÇÕES ESPECIAIS","-",null,null,null,null,"",null,"","","INSTALAÇÕES ESPECIAIS","-",0,0]
[3,3,3,7,2,7,1,0,0,7,{"$error":"#N/A"},"","Nível 3","Nível 3","2.7.1.","SINAPI",null,"INSTALAÇÕES DE INCÊNDIO","-",null,null,null,null,"",null,"","","INSTALAÇÕES DE INCÊNDIO","-",0,0]
["S",3,"S",0,2,7,1,0,0,0,0,"","Serviço","Serviço","2.7.1.1.","AGETOP",85006,"EXTINTOR MULTI USO EM PO A B C (6 KG) - CAPACIDADE EXTINTORA 3A 20BC","un    ",1,null,null,null,"",null,"","","(sem código)","-",0,0]
["S",3,"S",0,2,7,1,0,0,0,0,"","Serviço","Serviço","2.7.1.2.","SINAPI",97599,"LUMINÁRIA DE EMERGÊNCIA - FORNECIMENTO E INSTALAÇÃO. AF_11/2017","UN",1,null,null,null,"",null,"","","(sem código)","-",0,0]
["S",3,"S",0,2,7,1,0,0,0,0,"","Serviço","Serviço","2.7.1.3.","COMPOSIÇÃO","COMP 024_SEE","SINALIZADOR FOTOLUMINESCENTE PARA EXTINTOR","UN ",1,null,null,null,"",null,"","","(sem código)","-",0,0]
["S",3,"S",0,2,7,1,0,0,0,0,"","Serviço","Serviço","2.7.1.4.","COMPOSIÇÃO","COMP 025_SEE","SINALIZADOR FOTOLUMINESCENTE DE EMERGÊNCIA","UN ",2,null,null,null,"",null,"","","(sem código)","-",0,0]
["S",3,"S",0,2,7,1,0,0,0,0,"","Serviço","Serviço","2.7.1.5.","COMPOSIÇÃO","COMP 277_SEE","MARCAÇÃO NO PISO - 1X1 M PARA EXTINTOR","M2",1,null,null,null,"",null,"","","(sem código)","-",0,0]
["S",3,"S",0,2,7,1,0,0,0,0,"","Serviço","Serviço","2.7.1.6.","COMPOSIÇÃO","COMP 412_SEE","PLACA DE SINALIZAÇÃO EM PVC COD 17 - (316X158) MENSAGEM \"SAÍDA\"","UN ",1,null,null,null,"",null,"","","(sem código)","-",0,0]
[2,2,2,4,2,8,0,0,0,44,4,"","Nível 2","Nível 2","2.8.","AGETOP",null,"ALVENARIAS E DIVISÓRIAS","-",null,null,null,null,"",null,"","","ALVENARIAS E DIVISÓRIAS","-",0,0]
["S",2,"S",0,2,8,0,0,0,0,0,"","Serviço","Serviço","2.8.0.1.","SINAPI",87503,"ALVENARIA DE VEDAÇÃO DE BLOCOS CERÂMICOS FURADOS NA HORIZONTAL DE 9X19X19CM (ESPESSURA 9CM) DE PAREDES COM ÁREA LÍQUIDA MAIOR OU IGUAL A 6M² SEM VÃOS E ARGAMASSA DE ASSENTAMENTO COM PREPARO EM BETONEIRA. AF_06/2014","M2",45.88,null,null,null,"Referência: AGETOP - 100201","SIM","","","(sem código)","-",0,0]
["S",2,"S",0,2,8,0,0,0,0,0,"","Serviço","Serviço","2.8.0.2.","SINAPI",87519,"ALVENARIA DE VEDAÇÃO DE BLOCOS CERÂMICOS FURADOS NA HORIZONTAL DE 9X19X19CM (ESPESSURA 9CM) DE PAREDES COM ÁREA LÍQUIDA MAIOR OU IGUAL A 6M² COM VÃOS E ARGAMASSA DE ASSENTAMENTO COM PREPARO EM BETONEIRA. AF_06/2014","M2",33.75,null,null,null,"Referência: AGETOP - 100201","SIM","","","(sem código)","-",0,0]
["S",2,"S",0,2,8,0,0,0,0,0,"","Serviço","Serviço","2.8.0.3.","SINAPI",93201,"FIXAÇÃO (ENCUNHAMENTO) DE ALVENARIA DE VEDAÇÃO COM ARGAMASSA APLICADA COM COLHER. AF_03/2016","M",26.7,null,null,null,"",null,"","","(sem código)","-",0,0]
[2,2,2,2,2,9,0,0,0,40,2,"","Nível 2","Nível 2","2.9.",null,null,"IMPERMEABILIZAÇÃO","-",null,null,null,null,"",null,"","","IMPERMEABILIZAÇÃO","-",0,0]
["S",2,"S",0,2,9,0,0,0,0,0,"","Serviço","Serviço","2.9.0.1.","SINAPI","74106/1","IMPERMEABILIZACAO DE ESTRUTURAS ENTERRADAS, COM TINTA ASFALTICA, DUAS DEMAOS.","M2",30.65,null,null,null,"",null,"","","(sem código)","-",0,0]
[2,2,2,2,2,10,0,0,0,38,2,"","Nível 2","Nível 2","2.10.",null,null,"ESTRUTURAS METÁLICAS","-",null,null,null,null,"",null,"","","ESTRUTURAS METÁLICAS","-",0,0]
["S",2,"S",0,2,10,0,0,0,0,0,"","Serviço","Serviço","2.10.0.1.","AGETOP",150103,"ESTRUTURA METÁLICA CONVENCIONAL EM AÇO DO TIPO USI SAC-300 COM FUNDO ANTICORROSIVO","Kg    ",1291.08,null,null,null,"",null,"","","(sem código)","-",0,0]
[2,2,2,4,2,11,0,0,0,36,4,"","Nível 2","Nível 2","2.11.",null,null,"COBERTURAS","-",null,null,null,null,"",null,"","","COBERTURAS","-",0,0]
["S",2,"S",0,2,11,0,0,0,0,0,"","Serviço","Serviço","2.11.0.1.","SINAPI",94445,"TELHAMENTO COM TELHA CERÂMICA CAPA-CANAL, TIPO PLAN, COM ATÉ 2 ÁGUAS, INCLUSO TRANSPORTE VERTICAL. AF_07/2019","M2",88.69,null,null,null,"Referência: AGETOP - 160401","SIM","","","(sem código)","-",0,0]
[{"$f":"CHOOSE(1+LOG(1+2*(ORÇAMENTO.Nivel=\"Nível 1\")+4*(ORÇAMENTO.Nivel=\"Nível 2\")+8*(ORÇAMENTO.Nivel=\"Nível 3\")+16*(ORÇAMENTO.Nivel=\"Nível 4\")+32*(ORÇAMENTO.Nivel=\"Serviço\"),2),0,1,2,3,4,\"S\")","v":"S"},2,"S",0,2,11,0,0,0,0,0,"","Serviço","Serviço","2.11.0.2.","SINAPI",94221,"CUMEEIRA PARA TELHA CERÂMICA EMBOÇADA COM ARGAMASSA TRAÇO 1:2:9 (CIMENTO, CAL E AREIA) PARA TELHADOS COM ATÉ 2 ÁGUAS, INCLUSO TRANSPORTE VERTICAL. AF_07/2019","M",9.0500000000000007,null,null,null,"","NÃO","","","(sem código)","-",0,0]
["S",2,"S",0,2,11,0,0,0,{"$f":"IF(OR($C300=\"S\",$C300=0),0,MATCH(0,OFFSET($D300,1,$C300,ROW($C$333)-ROW($C300)),0))","v":0},{"$f":"IF(OR($C300=\"S\",$C300=0),0,MATCH(OFFSET($D300,0,$C300)+1,OFFSET($D300,1,$C300,ROW($C$333)-ROW($C300)),0))","v":0},"","Serviço","Serviço","2.11.0.3.","SINAPI",94224,"EMBOÇAMENTO COM ARGAMASSA TRAÇO 1:2:9 (CIMENTO, CAL E AREIA). AF_07/2019","M",34.14,null,null,null,"Referência: AGETOP - 160403","SIM","","","(sem código)","-",0,0]
[2,2,2,4,2,12,0,0,0,32,4,"","Nível 2","Nível 2","2.12.",null,null,"ESQUADRIAS METÁLICAS","-",null,null,null,null,"",null,"","","ESQUADRIAS METÁLICAS","-",0,0]
["S",2,"S",0,2,12,0,0,0,0,0,"","Serviço","Serviço","2.12.0.1.","SINAPI",94562,"JANELA DE AÇO DE CORRER COM 4 FOLHAS PARA VIDRO, COM BATENTE, FERRAGENS E PINTURA ANTICORROSIVA. EXCLUSIVE VIDROS, ALIZAR E CONTRAMARCO. FORNECIMENTO E INSTALAÇÃO. AF_12/2019","M2",4.8,null,null,null,"Referência: AGETOP - 180401","SIM","","","(sem código)","-",0,0]
["S",2,"S",0,2,12,0,0,0,0,0,"","Serviço","Serviço","2.12.0.2.","SINAPI",94559,"JANELA DE AÇO TIPO BASCULANTE PARA VIDROS, COM BATENTE, FERRAGENS E PINTURA ANTICORROSIVA. EXCLUSIVE VIDROS, ACABAMENTO, ALIZAR E CONTRAMARCO. FORNECIMENTO E INSTALAÇÃO. AF_12/2019","M2",2.4,null,null,null,"Referência: AGETOP - 180404","SIM","","","(sem código)","-",0,0]
["S",2,"S",0,2,12,0,0,0,0,0,"","Serviço","Serviço","2.12.0.3.","AGETOP",180501,"PORTA DE ABRIR EM CHAPA PF-1 C/FERRAGENS","m2    ",1.6800000000000002,null,null,null,"",null,"","","(sem código)","-",0,0]
[2,2,2,2,2,13,0,0,0,28,2,"","Nível 2","Nível 2","2.13.",null,null,"VIDROS","-",null,null,null,null,"",null,"","","VIDROS","-",0,0]
["S",2,"S",0,2,13,0,0,0,0,0,"","Serviço","Serviço","2.13.0.1.","SINAPI",72117,"VIDRO LISO COMUM TRANSPARENTE, ESPESSURA 4MM","M2",7.1999999999999993,null,null,null,"Referência: AGETOP - 190102","SIM","","","(sem código)","-",0,0]
[2,2,2,5,2,14,0,0,0,26,5,"","Nível 2","Nível 2","2.14.",null,null,"REVESTIMENTO DE PAREDE","-",null,null,null,null,"",null,"","","REVESTIMENTO DE PAREDE","-",0,0]
["S",2,"S",0,2,14,0,0,0,0,0,"","Serviço","Serviço","2.14.0.1.","SINAPI",87879,"CHAPISCO APLICADO EM ALVENARIAS E ESTRUTURAS DE CONCRETO INTERNAS, COM COLHER DE PEDREIRO.  ARGAMASSA TRAÇO 1:3 COM PREPARO EM BETONEIRA 400L. AF_06/2014","M2",164.13,null,null,null,"","NÃO","","","(sem código)","-",0,0]
["S",2,"S",0,2,14,0,0,0,0,0,"","Serviço","Serviço","2.14.0.2.","SINAPI",87775,"EMBOÇO OU MASSA ÚNICA EM ARGAMASSA TRAÇO 1:2:8, PREPARO MECÂNICO COM BETONEIRA 400 L, APLICADA MANUALMENTE EM PANOS DE FACHADA COM PRESENÇA DE VÃOS, ESPESSURA DE 25 MM. AF_06/2014","M2",38.549999999999997,null,null,null,"",null,"","","(sem código)","-",0,0]
["S",2,"S",0,2,14,0,0,0,0,0,"","Serviço","Serviço","2.14.0.3.","SINAPI",87792,"EMBOÇO OU MASSA ÚNICA EM ARGAMASSA TRAÇO 1:2:8, PREPARO MECÂNICO COM BETONEIRA 400 L, APLICADA MANUALMENTE EM PANOS CEGOS DE FACHADA (SEM PRESENÇA DE VÃOS), ESPESSURA DE 25 MM. AF_06/2014","M2",50.02,null,null,null,"",null,"","","(sem código)","-",0,0]
["S",2,"S",0,2,14,0,0,0,0,0,"","Serviço","Serviço","2.14.0.4.","SINAPI",87548,"MASSA ÚNICA, PARA RECEBIMENTO DE PINTURA, EM ARGAMASSA TRAÇO 1:2:8, PREPARO MANUAL, APLICADA MANUALMENTE EM FACES INTERNAS DE PAREDES, ESPESSURA DE 10MM, COM EXECUÇÃO DE TALISCAS. AF_06/2014","M2",74.819999999999993,null,null,null,"Referência: AGETOP - 200500","SIM","","","(sem código)","-",0,0]
[2,2,2,2,2,15,0,0,0,21,2,"","Nível 2","Nível 2","2.15.",null,null,"FORROS","-",null,null,null,null,"",null,"","","FORROS","-",0,0]
["S",2,"S",0,2,15,0,0,0,0,0,"","Serviço","Serviço","2.15.0.1.","SINAPI",87414,"APLICAÇÃO MANUAL DE GESSO DESEMPENADO (SEM TALISCAS) EM TETO DE AMBIENTES DE ÁREA MAIOR QUE 10M², ESPESSURA DE 1,0CM. AF_06/2014","M2",48.51,null,null,null,"Referência: AGETOP - 210515","SIM","","","(sem código)","-",0,0]
[2,2,2,5,2,16,0,0,0,19,5,"","Nível 2","Nível 2","2.16.","SINAPI",null,"REVESTIMENTO DE PISO","-",null,null,null,null,"",null,"","","REVESTIMENTO DE PISO","-",0,0]
["S",2,"S",0,2,16,0,0,0,0,0,"","Serviço","Serviço","2.16.0.1.","SINAPI",95240,"LASTRO DE CONCRETO MAGRO, APLICADO EM PISOS OU RADIERS, ESPESSURA DE 3 CM. AF_07/2016","M2",84.96,null,null,null,"","NÃO","","","(sem código)","-",0,0]
["S",2,"S",0,2,16,0,0,0,0,0,"","Serviço","Serviço","2.16.0.2.","SINAPI",94992,"EXECUÇÃO DE PASSEIO (CALÇADA) OU PISO DE CONCRETO COM CONCRETO MOLDADO IN LOCO, FEITO EM OBRA, ACABAMENTO CONVENCIONAL, ESPESSURA 6 CM, ARMADO. AF_07/2016","M2",20.7,null,null,null,"",null,"","","(sem código)","-",0,0]
["S",2,"S",0,2,16,0,0,0,0,0,"","Serviço","Serviço","2.16.0.3.","SINAPI",84191,"PISO EM GRANILITE, MARMORITE OU GRANITINA ESPESSURA 8 MM, INCLUSO JUNTAS DE DILATACAO PLASTICAS","M2",62.35,null,null,null,"Referência: AGETOP - 221101","SIM","","","(sem código)","-",0,0]
["S",2,"S",0,2,16,0,0,0,0,0,"","Serviço","Serviço","2.16.0.4.","AGETOP",221104,"RASPAGEM E APLICAÇÃO RESINA ACRÍLICA DUAS DEMÃOS","m2    ",62.35,null,null,null,"",null,"","","(sem código)","-",0,0]
[2,2,2,2,2,17,0,0,0,14,2,"","Nível 2","Nível 2","2.17.","SINAPI",null,"MARCENARIA","-",null,null,null,null,"",null,"","","MARCENARIA","-",{"$f":"IFERROR(VLOOKUP($AA319,INDIRECT($Z319),IF($T$11=\"DESONERADA\",4,7),FALSE()),0)","v":0},{"$f":"IFERROR(VLOOKUP($AA319,INDIRECT($Z319),IF($T$11=\"DESONERADA\",5,8),FALSE()),0)","v":0}]
["S",2,"S",0,2,17,0,0,0,0,0,"","Serviço","Serviço","2.17.0.1.","AGETOP",240106,"BATE CARTEIRA ENVERNIZADO E ASSENT. 2,5 X 12 CM","M     ",20.34,null,null,null,"",null,"","","(sem código)","-",0,0]
[2,{"$f":"IF(OR(C321=\"s\",C321=0),OFFSET(B321,-1,0),C321)","v":2},{"$f":"IF(OFFSET(C321,-1,0)=\"L\",1,IF(OFFSET(C321,-1,0)=1,2,IF(OR(A321=\"s\",A321=0),\"S\",IF(AND(OFFSET(C321,-1,0)=2,A321=4),3,IF(AND(OR(OFFSET(C321,-1,0)=\"s\",OFFSET(C321,-1,0)=0),A321<>\"s\",A321>OFFSET(B321,-1,0)),OFFSET(B321,-1,0),A321)))))","v":2},{"$f":"IF(OR(C321=\"S\",C321=0),0,IF(ISERROR(K321),J321,SMALL(J321:K321,1)))","v":9},{"$f":"IF($C321=1,OFFSET(E321,-1,0)+1,OFFSET(E321,-1,0))","v":2},{"$f":"IF($C321=1,0,IF($C321=2,OFFSET(F321,-1,0)+1,OFFSET(F321,-1,0)))","v":18},{"$f":"IF(AND($C321<=2,$C321<>0),0,IF($C321=3,OFFSET(G321,-1,0)+1,OFFSET(G321,-1,0)))","v":0},{"$f":"IF(AND($C321<=3,$C321<>0),0,IF($C321=4,OFFSET(H321,-1,0)+1,OFFSET(H321,-1,0)))","v":0},{"$f":"IF(AND($C321<=4,$C321<>0),0,IF(AND($C321=\"S\",$W321>0),OFFSET(I321,-1,0)+1,OFFSET(I321,-1,0)))","v":0},12,9,{"$f":"IF(OR(W321>0,$C321=1),\"F\",\"\")","v":""},"Nível 2",{"$f":"CHOOSE(1+LOG(1+2*(C321=1)+4*(C321=2)+8*(C321=3)+16*(C321=4)+32*(C321=\"S\"),2),\"\",\"Nível 1\",\"Nível 2\",\"Nível 3\",\"Nível 4\",\"Serviço\")","v":"Nível 2"},"2.18.","SINAPI",null,"PINTURA","-",null,null,null,null,"",null,{"$f":"IFERROR(VLOOKUP(Q321,INDIRECT(\"EQUIVALÊNCIAS\"),4,FALSE),\"\")","v":""},{"$f":"IFERROR(VLOOKUP(Q321,INDIRECT(\"EQUIVALÊNCIAS\"),5,FALSE),\"\")","v":""},{"$f":"IFERROR(IF(OR($C321=0,$C321=1,$C321=2,$C321=3,$C321=4),R321,VLOOKUP($AA321,INDIRECT($Z321),2,FALSE)),\"(sem código)\")","v":"PINTURA"},{"$f":"IFERROR(VLOOKUP(AA321,INDIRECT(Z321),3,FALSE()),\"-\")","v":"-"},0,0]
["S",2,"S",0,2,18,0,0,0,0,0,"","Serviço","Serviço","2.18.0.1.","SINAPI","74145/1","PINTURA ESMALTE FOSCO, DUAS DEMAOS, SOBRE SUPERFICIE METALICA, INCLUSO UMA DEMAO DE FUNDO ANTICORROSIVO. UTILIZACAO DE REVOLVER ( AR-COMPRIMIDO).","M2",88.69,null,null,null,"Referência: AGETOP - 261602","SIM","","","(sem código)","-",0,0]
["S",2,"S",0,2,18,0,0,0,0,0,"","Serviço","Serviço","2.18.0.2.","SINAPI",88423,"APLICAÇÃO MANUAL DE PINTURA COM TINTA TEXTURIZADA ACRÍLICA EM PAREDES EXTERNAS DE CASAS, UMA COR. AF_06/2014","M2",50.02,null,null,null,"Referência: AGETOP - 260601","SIM","","","(sem código)","-",0,0]
["S",2,"S",0,2,18,0,0,0,0,0,"","Serviço","Serviço","2.18.0.3.","SINAPI",88489,"APLICAÇÃO MANUAL DE PINTURA COM TINTA LÁTEX ACRÍLICA EM PAREDES, DUAS DEMÃOS. AF_06/2014","M2",52.45,null,null,null,"Referência: AGETOP - 261001","SIM","","","(sem código)","-",0,0]
["S",2,"S",0,2,18,0,0,0,0,0,"","Serviço","Serviço","2.18.0.4.","SINAPI",88497,"APLICAÇÃO E LIXAMENTO DE MASSA LÁTEX EM PAREDES, DUAS DEMÃOS. AF_06/2014","M2",108.33000000000001,null,null,null,"Referência: AGETOP - 261300","SIM","","","(sem código)","-",0,0]
["S",2,"S",0,2,18,0,0,0,0,0,"","Serviço","Serviço","2.18.0.5.","AGETOP",261550,"PINT.ESMALTE SINT.PAREDES - 2 DEM.C/SELADOR","m2    ",55.88,null,null,null,"",null,"","","(sem código)","-",0,0]
["S",2,"S",0,2,18,0,0,0,0,0,"","Serviço","Serviço","2.18.0.6.","SINAPI",88496,"APLICAÇÃO E LIXAMENTO DE MASSA LÁTEX EM TETO, DUAS DEMÃOS. AF_06/2014","M2",48.51,null,null,null,"Referência: AGETOP - 261300","SIM","","","(sem código)","-",0,0]
["S",2,"S",0,2,18,0,0,0,0,0,"","Serviço","Serviço","2.18.0.7.","SINAPI",88488,"APLICAÇÃO MANUAL DE PINTURA COM TINTA LÁTEX ACRÍLICA EM TETO, DUAS DEMÃOS. AF_06/2014","M2",48.51,null,null,null,"",null,"","","(sem código)","-",0,0]
["S",2,"S",0,2,18,0,0,0,0,0,"","Serviço","Serviço","2.18.0.8.","SINAPI","74145/1","PINTURA ESMALTE FOSCO, DUAS DEMAOS, SOBRE SUPERFICIE METALICA, INCLUSO UMA DEMAO DE FUNDO ANTICORROSIVO. UTILIZACAO DE REVOLVER ( AR-COMPRIMIDO).","M2",19.439999999999998,null,null,null,"Referência: AGETOP - 261602","SIM","","","(sem código)","-",0,0]
[2,2,2,3,2,19,0,0,0,3,{"$error":"#N/A"},"","Nível 2","Nível 2","2.19.","SINAPI",null,"DIVERSOS","-",null,null,null,null,"",null,"","","DIVERSOS","-",0,0]
["S",2,"S",0,2,19,0,0,0,0,0,"","Serviço","Serviço","2.19.0.1.","AGETOP",271210,"QUADRO DE GIZ EMBOÇO/PINTURA COMPLETO","m2    ",5.04,null,null,null,"",null,"","","(sem código)","-",0,0]
["S",2,"S",0,2,19,0,0,0,0,0,"","Serviço","Serviço","2.19.0.2.","AGETOP",270501,"LIMPEZA FINAL DE OBRA - (OBRAS CIVIS)","m2    ",64.260000000000005,null,null,null,"",null,"","","(sem código)","-",0,0]
[-1,null,-1,null,0,0,0,0,0,null,null,"F"]
[null,null,null,null,null,null,null,null,null,null,null,"F",null,null,null,null,null,"OBS: OS QUANTITATIVOS DE MATERIAIS  DAS INSTALAÇÕES HIDROSSANITÁRIAS, ELÉTRICAS E ESPECIAIS SÃO FORNECIDOS PELOS PROFISSIONAIS RESPONSÁVEIS PELOS RESPECTIVOS PROJETOS.",null,null,"VALOR TOTAL"]
[null,null,null,null,null,null,null,null,null,null,null,"F",null,null,null,null,null,null,null,null,"VALOR BDI (20,34%)"]
[null,null,null,null,null,null,null,null,null,null,null,"F",null,null,null,null,null,null,null,null,"TOTAL ORÇAMENTO"]
[null,null,null,null,null,null,null,null,null,null,null,"F"]
[null,null,null,null,null,null,null,null,null,null,null,"F",null,null,null,null,null,null,null,null,"CUSTO POR M2 ³"]
[null,null,null,null,null,null,null,null,null,null,null,"F",null,null,null,null,null,null,null,null,"MATERIAL S/ BDI"]
[null,null,null,null,null,null,null,null,null,null,null,"F",null,null,null,null,null,null,null,null,"MÃO DE OBRA S/ BDI"]
[null,null,null,null,null,null,null,null,null,null,null,"F"]
[null,null,null,null,null,null,null,null,null,null,null,"F",null,null,null,null,"(1) Conforme previsto pelo DECRETO Nº 7.983, DE 8 DE ABRIL DE 2013, os preços adotados são aqueles constantes dos sistemas de referência indicados. Justifica-se o uso dos preços destas composições de custos unitários devido ao seu valor ser menor à mediana de seus correspondentes na tabela SINAPI;"]
[null,null,null,null,null,null,null,null,null,null,null,"F",null,null,null,null,"(2) Optou-se pelo uso das composições de custos da AGETOP para itens não presentes na SINAPI;"]
[null,null,null,null,null,null,null,null,null,null,null,"F",null,null,null,null,"(3) Para itens da AGETOP, os vidros não estão inclusos nas esquadrias e já foram considerados os custos de contramarco para as esquadrias de alumínio;"]
[null,null,null,null,null,null,null,null,null,null,null,"F",null,null,null,null,"(4) Nos casos em que houver execução de granitina e omissão do item AGETOP 221102, considerou-se que o quantitativo para o rodapé, de altura igual a 7cm, foi incorporado na área de piso;"]
[null,null,null,null,null,null,null,null,null,null,null,"F",null,null,null,null,"(5) O custo unitário aproximado por metro quadrado é calculado dividindo-se o valor total do orçamento pela área total de construção."]
[null,null,null,null,null,null,null,null,null,null,null,"F"]
[null,null,null,null,null,null,null,null,null,null,null,"F"]
[]
[null,null,null,null,null,null,null,null,null,null,null,null,null,null,"SOMATÓRIO DE SERVIÇOS"]
[null,null,null,null,null,null,null,null,null,null,null,null,null,null,"ITEM","DESCRIÇÃO DOS SERVIÇOS",null,null,"PREÇO SEM BDI",null,null,"PREÇO COM BDI",null,"PARTICIPAÇÃO ( % )"]
[null,null,null,null,null,null,null,null,null,null,null,null,null,null,"a.","SERVIÇOS PRELIMINARES",null,null,{"$f":"SUMIF($R$20:$R$333,$P352,$W$20:$W$333)","v":0},null,null,{"$f":"ROUND(S352*(1+BDI.Taxa),2)","v":0},null,{"$f":"IFERROR(ROUND($V352*100/$W$336,2),0)","v":0}]
[null,null,null,null,null,null,null,null,null,null,null,null,null,null,"b.","TRANSPORTES",null,null,0,null,null,0,null,{"$f":"IFERROR(ROUND($V353*100/$W$336,2),0)","v":0}]
[null,null,null,null,null,null,null,null,null,null,null,null,null,null,"c.","SERVIÇO EM TERRA",null,null,0,null,null,0,null,0]
[null,null,null,null,null,null,null,null,null,null,null,null,null,null,"d.","FUNDAÇÕES E SONDAGENS",null,null,0,null,null,0,null,0]
[null,null,null,null,null,null,null,null,null,null,null,null,null,null,"e.","ESTRUTURA",null,null,0,null,null,0,null,0]
[null,null,null,null,null,null,null,null,null,null,null,null,null,null,"f.","INSTALAÇÕES ELÉTRICAS",null,null,0,null,null,0,null,0]
[null,null,null,null,null,null,null,null,null,null,null,null,null,null,"g.","INSTALAÇÕES HIDROSSANITÁRIAS",null,null,0,null,null,0,null,0]
[null,null,null,null,null,null,null,null,null,null,null,null,null,null,"h","INSTALAÇÕES ESPECIAIS",null,null,0,null,null,0,null,0]
[null,null,null,null,null,null,null,null,null,null,null,null,null,null,"i.","ALVENARIAS E DIVISÓRIAS",null,null,0,null,null,0,null,0]
[null,null,null,null,null,null,null,null,null,null,null,null,null,null,"j.","ALVENARIA AUTO-PORTANTE",null,null,0,null,null,0,null,0]
[null,null,null,null,null,null,null,null,null,null,null,null,null,null,"k.","IMPERMEABILIZAÇÃO",null,null,0,null,null,0,null,0]
[null,null,null,null,null,null,null,null,null,null,null,null,null,null,"l.","ISOLAMENTO TÉRMICO E ACÚSTICO",null,null,0,null,null,0,null,0]
[null,null,null,null,null,null,null,null,null,null,null,null,null,null,"m.","ESTRUTURA DE MADEIRA",null,null,0,null,null,0,null,0]
[null,null,null,null,null,null,null,null,null,null,null,null,null,null,"n.","ESTRUTURAS METÁLICAS",null,null,0,null,null,0,null,0]
[null,null,null,null,null,null,null,null,null,null,null,null,null,null,"o.","COBERTURAS",null,null,0,null,null,0,null,0]
[null,null,null,null,null,null,null,null,null,null,null,null,null,null,"p.","ESQUADRIAS DE MADEIRA",null,null,0,null,null,0,null,0]
[null,null,null,null,null,null,null,null,null,null,null,null,null,null,"q.","ESQUADRIAS METÁLICAS",null,null,0,null,null,{"$f":"ROUND(S368*(1+BDI.Taxa),2)","v":0},null,0]
[null,null,null,null,null,null,null,null,null,null,null,null,null,null,"r.","VIDROS",null,null,0,null,null,0,null,0]
[null,null,null,null,null,null,null,null,null,null,null,null,null,null,"s.","REVESTIMENTO DE PAREDE",null,null,0,null,null,0,null,0]
[null,null,null,null,null,null,null,null,null,null,null,null,null,null,"t.","FORROS",null,null,0,null,null,0,null,0]
[null,null,null,null,null,null,null,null,null,null,null,null,null,null,"u.","REVESTIMENTO DE PISO",null,null,0,null,null,0,null,0]
[null,null,null,null,null,null,null,null,null,null,null,null,null,null,"v.","FERRAGENS",null,null,0,null,null,0,null,0]
[null,null,null,null,null,null,null,null,null,null,null,null,null,null,"w.","MARCENARIA",null,null,0,null,null,0,null,0]
[null,null,null,null,null,null,null,null,null,null,null,null,null,null,"x.","ADMINISTRAÇÃO",null,null,0,null,null,0,null,0]
[null,null,null,null,null,null,null,null,null,null,null,null,null,null,"y.","PINTURA",null,null,0,null,null,{"$f":"ROUND(S376*(1+BDI.Taxa),2)","v":0},null,0]
[null,null,null,null,null,null,null,null,null,null,null,null,null,null,"z.","DIVERSOS",null,null,0,null,null,{"$f":"IF(S377>0,IF((SUM(V352:W376)+ROUND(S377*(1+BDI.Taxa),2))<>V379,V379-SUM(V352:W376),ROUND(S377*(1+BDI.Taxa),2)),0)","v":0},null,{"$f":"IF(S377>0,IF((SUM(X352:X376)+IFERROR(ROUND($V377*100/$W$336,2),0))<>X379,X379-SUM(X352:X376),IFERROR(ROUND($V377*100/$W$336,2),0)),0)","v":0}]
[null,null,null,null,null,null,null,null,null,null,null,null,null,null,"TOTAL GERAL DO ORÇAMENTO (R$)",null,null,null,{"$f":"SUM(S352:U377)","v":0},null,null,{"$f":"SUM(V352:W377)","v":0},null,{"$f":"SUM(X352:X377)","v":0}]
[null,null,null,null,null,null,null,null,null,null,null,null,null,null,null,null,null,null,{"$f":"$W$334","v":0},null,null,{"$f":"$W$336","v":0},null,100]
[null,null,null,null,null,null,null,null,null,null,null,null,null,null,null,null,null,null,"(TOTAL SEM BDI)",null,null,"(TOTAL COM BDI)",null,"(ARRED porcentagem)"]
[null,null,null,null,null,null,null,null,null,null,null,null,null,null,null,null,null,null,{"$f":"IF(AND(S378=S379,S378>0),\"OK\",\"ERRO\")","v":"ERRO"},null,null,{"$f":"IF(AND(V378=V379,V378>0),\"OK\",\"ERRO\")","v":"ERRO"},null,{"$f":"IF(X378=100,\"OK\",\"ERRO\")","v":"ERRO"}]
[]
[]
[null,null,null,null,null,null,null,null,null,null,null,null,null,null,"RESUMO GERAL DO ORÇAMENTO"]
[null,null,null,null,null,null,null,null,null,null,null,null,null,null,"ITEM","DESCRIÇÃO DOS SERVIÇOS",null,null,"PREÇO SEM BDI",null,null,"PREÇO COM BDI",null,"PARTICIPAÇÃO ( % )"]
[null,null,null,null,null,null,null,null,null,null,null,null,null,null,"1.",{"$f":"IFERROR(VLOOKUP(O386,$O$20:$W$333,4,FALSE),\"\")","v":"REFORMA"},null,null,{"$f":"IF(P387=\"\",$S$407-SUM(OFFSET($S$385:S385,0,0,COUNTA($S$385:S385),1)),SUMIF($R$20:$R$333,$P386,$W$20:$W$333))","v":169788.31999999998},null,null,{"$f":"IF(P387=\"\",$V$407-SUM(OFFSET($V$385:V385,0,0,COUNTA($V$385:V385),1)),ROUND(S386*(1+BDI.Taxa),2))","v":204330.84},null,{"$f":"IF(P387=\"\",$X$407-SUM(OFFSET($X$385:X385,0,0,COUNTA($X$385:X385),1)),ROUND(V386*100/ORÇAMENTO.Totalorçamento,2))","v":{"$error":"#DIV/0!"}}]
[null,null,null,null,null,null,null,null,null,null,null,null,null,null,"2.","BLOCO 01 SALA DE AULA PADRÃO SEDUC 2017 - LAJE",null,null,{"$f":"IF(P388=\"\",$S$407-SUM(OFFSET($S$385:S386,0,0,COUNTA($S$385:S386),1)),SUMIF($R$20:$R$333,$P387,$W$20:$W$333))","v":-169788.31999999998},null,null,{"$f":"IF(P388=\"\",$V$407-SUM(OFFSET($V$385:V386,0,0,COUNTA($V$385:V386),1)),ROUND(S387*(1+BDI.Taxa),2))","v":-204330.84},null,{"$f":"IF(P388=\"\",$X$407-SUM(OFFSET($X$385:X386,0,0,COUNTA($X$385:X386),1)),ROUND(V387*100/ORÇAMENTO.Totalorçamento,2))","v":{"$error":"#DIV/0!"}}]
[null,null,null,null,null,null,null,null,null,null,null,null,null,null,"3.","",null,null,{"$f":"IF(P389=\"\",$S$407-SUM(OFFSET($S$385:S387,0,0,COUNTA($S$385:S387),1)),SUMIF($R$20:$R$333,$P388,$W$20:$W$333))","v":0},null,null,{"$f":"IF(P389=\"\",$V$407-SUM(OFFSET($V$385:V387,0,0,COUNTA($V$385:V387),1)),ROUND(S388*(1+BDI.Taxa),2))","v":0},null,{"$f":"IF(P389=\"\",$X$407-SUM(OFFSET($X$385:X387,0,0,COUNTA($X$385:X387),1)),ROUND(V388*100/ORÇAMENTO.Totalorçamento,2))","v":{"$error":"#DIV/0!"}}]
[null,null,null,null,null,null,null,null,null,null,null,null,null,null,"4.","",null,null,{"$f":"IF(P390=\"\",$S$407-SUM(OFFSET($S$385:S388,0,0,COUNTA($S$385:S388),1)),SUMIF($R$20:$R$333,$P389,$W$20:$W$333))","v":0},null,null,{"$f":"IF(P390=\"\",$V$407-SUM(OFFSET($V$385:V388,0,0,COUNTA($V$385:V388),1)),ROUND(S389*(1+BDI.Taxa),2))","v":0},null,{"$f":"IF(P390=\"\",$X$407-SUM(OFFSET($X$385:X388,0,0,COUNTA($X$385:X388),1)),ROUND(V389*100/ORÇAMENTO.Totalorçamento,2))","v":{"$error":"#DIV/0!"}}]
[null,null,null,null,null,null,null,null,null,null,null,null,null,null,"5.","",null,null,{"$f":"IF(P391=\"\",$S$407-SUM(OFFSET($S$385:S389,0,0,COUNTA($S$385:S389),1)),SUMIF($R$20:$R$333,$P390,$W$20:$W$333))","v":0},null,null,{"$f":"IF(P391=\"\",$V$407-SUM(OFFSET($V$385:V389,0,0,COUNTA($V$385:V389),1)),ROUND(S390*(1+BDI.Taxa),2))","v":0},null,{"$f":"IF(P391=\"\",$X$407-SUM(OFFSET($X$385:X389,0,0,COUNTA($X$385:X389),1)),ROUND(V390*100/ORÇAMENTO.Totalorçamento,2))","v":{"$error":"#DIV/0!"}}]
[null,null,null,null,null,null,null,null,null,null,null,null,null,null,"6.","",null,null,{"$f":"IF(P392=\"\",$S$407-SUM(OFFSET($S$385:S390,0,0,COUNTA($S$385:S390),1)),SUMIF($R$20:$R$333,$P391,$W$20:$W$333))","v":0},null,null,{"$f":"IF(P392=\"\",$V$407-SUM(OFFSET($V$385:V390,0,0,COUNTA($V$385:V390),1)),ROUND(S391*(1+BDI.Taxa),2))","v":0},null,{"$f":"IF(P392=\"\",$X$407-SUM(OFFSET($X$385:X390,0,0,COUNTA($X$385:X390),1)),ROUND(V391*100/ORÇAMENTO.Totalorçamento,2))","v":{"$error":"#DIV/0!"}}]
[null,null,null,null,null,null,null,null,null,null,null,null,null,null,"7.","",null,null,{"$f":"IF(P393=\"\",$S$407-SUM(OFFSET($S$385:S391,0,0,COUNTA($S$385:S391),1)),SUMIF($R$20:$R$333,$P392,$W$20:$W$333))","v":0},null,null,{"$f":"IF(P393=\"\",$V$407-SUM(OFFSET($V$385:V391,0,0,COUNTA($V$385:V391),1)),ROUND(S392*(1+BDI.Taxa),2))","v":0},null,{"$f":"IF(P393=\"\",$X$407-SUM(OFFSET($X$385:X391,0,0,COUNTA($X$385:X391),1)),ROUND(V392*100/ORÇAMENTO.Totalorçamento,2))","v":{"$error":"#DIV/0!"}}]
[null,null,null,null,null,null,null,null,null,null,null,null,null,null,"8.","",null,null,{"$f":"IF(P394=\"\",$S$407-SUM(OFFSET($S$385:S392,0,0,COUNTA($S$385:S392),1)),SUMIF($R$20:$R$333,$P393,$W$20:$W$333))","v":0},null,null,{"$f":"IF(P394=\"\",$V$407-SUM(OFFSET($V$385:V392,0,0,COUNTA($V$385:V392),1)),ROUND(S393*(1+BDI.Taxa),2))","v":0},null,{"$f":"IF(P394=\"\",$X$407-SUM(OFFSET($X$385:X392,0,0,COUNTA($X$385:X392),1)),ROUND(V393*100/ORÇAMENTO.Totalorçamento,2))","v":{"$error":"#DIV/0!"}}]
[null,null,null,null,null,null,null,null,null,null,null,null,null,null,"9.","",null,null,{"$f":"IF(P395=\"\",$S$407-SUM(OFFSET($S$385:S393,0,0,COUNTA($S$385:S393),1)),SUMIF($R$20:$R$333,$P394,$W$20:$W$333))","v":0},null,null,{"$f":"IF(P395=\"\",$V$407-SUM(OFFSET($V$385:V393,0,0,COUNTA($V$385:V393),1)),ROUND(S394*(1+BDI.Taxa),2))","v":0},null,{"$f":"IF(P395=\"\",$X$407-SUM(OFFSET($X$385:X393,0,0,COUNTA($X$385:X393),1)),ROUND(V394*100/ORÇAMENTO.Totalorçamento,2))","v":{"$error":"#DIV/0!"}}]
[null,null,null,null,null,null,null,null,null,null,null,null,null,null,"10.","",null,null,{"$f":"IF(P396=\"\",$S$407-SUM(OFFSET($S$385:S394,0,0,COUNTA($S$385:S394),1)),SUMIF($R$20:$R$333,$P395,$W$20:$W$333))","v":0},null,null,{"$f":"IF(P396=\"\",$V$407-SUM(OFFSET($V$385:V394,0,0,COUNTA($V$385:V394),1)),ROUND(S395*(1+BDI.Taxa),2))","v":0},null,{"$f":"IF(P396=\"\",$X$407-SUM(OFFSET($X$385:X394,0,0,COUNTA($X$385:X394),1)),ROUND(V395*100/ORÇAMENTO.Totalorçamento,2))","v":{"$error":"#DIV/0!"}}]
[null,null,null,null,null,null,null,null,null,null,null,null,null,null,"11.","",null,null,{"$f":"IF(P397=\"\",$S$407-SUM(OFFSET($S$385:S395,0,0,COUNTA($S$385:S395),1)),SUMIF($R$20:$R$333,$P396,$W$20:$W$333))","v":0},null,null,{"$f":"IF(P397=\"\",$V$407-SUM(OFFSET($V$385:V395,0,0,COUNTA($V$385:V395),1)),ROUND(S396*(1+BDI.Taxa),2))","v":0},null,{"$f":"IF(P397=\"\",$X$407-SUM(OFFSET($X$385:X395,0,0,COUNTA($X$385:X395),1)),ROUND(V396*100/ORÇAMENTO.Totalorçamento,2))","v":{"$error":"#DIV/0!"}}]
[null,null,null,null,null,null,null,null,null,null,null,null,null,null,"12.","",null,null,{"$f":"IF(P398=\"\",$S$407-SUM(OFFSET($S$385:S396,0,0,COUNTA($S$385:S396),1)),SUMIF($R$20:$R$333,$P397,$W$20:$W$333))","v":0},null,null,{"$f":"IF(P398=\"\",$V$407-SUM(OFFSET($V$385:V396,0,0,COUNTA($V$385:V396),1)),ROUND(S397*(1+BDI.Taxa),2))","v":0},null,{"$f":"IF(P398=\"\",$X$407-SUM(OFFSET($X$385:X396,0,0,COUNTA($X$385:X396),1)),ROUND(V397*100/ORÇAMENTO.Totalorçamento,2))","v":{"$error":"#DIV/0!"}}]
[null,null,null,null,null,null,null,null,null,null,null,null,null,null,"13.","",null,null,{"$f":"IF(P399=\"\",$S$407-SUM(OFFSET($S$385:S397,0,0,COUNTA($S$385:S397),1)),SUMIF($R$20:$R$333,$P398,$W$20:$W$333))","v":0},null,null,{"$f":"IF(P399=\"\",$V$407-SUM(OFFSET($V$385:V397,0,0,COUNTA($V$385:V397),1)),ROUND(S398*(1+BDI.Taxa),2))","v":0},null,{"$f":"IF(P399=\"\",$X$407-SUM(OFFSET($X$385:X397,0,0,COUNTA($X$385:X397),1)),ROUND(V398*100/ORÇAMENTO.Totalorçamento,2))","v":{"$error":"#DIV/0!"}}]
[null,null,null,null,null,null,null,null,null,null,null,null,null,null,"14.","",null,null,{"$f":"IF(P400=\"\",$S$407-SUM(OFFSET($S$385:S398,0,0,COUNTA($S$385:S398),1)),SUMIF($R$20:$R$333,$P399,$W$20:$W$333))","v":0},null,null,{"$f":"IF(P400=\"\",$V$407-SUM(OFFSET($V$385:V398,0,0,COUNTA($V$385:V398),1)),ROUND(S399*(1+BDI.Taxa),2))","v":0},null,{"$f":"IF(P400=\"\",$X$407-SUM(OFFSET($X$385:X398,0,0,COUNTA($X$385:X398),1)),ROUND(V399*100/ORÇAMENTO.Totalorçamento,2))","v":{"$error":"#DIV/0!"}}]
[null,null,null,null,null,null,null,null,null,null,null,null,null,null,"15.","",null,null,{"$f":"IF(P401=\"\",$S$407-SUM(OFFSET($S$385:S399,0,0,COUNTA($S$385:S399),1)),SUMIF($R$20:$R$333,$P400,$W$20:$W$333))","v":0},null,null,{"$f":"IF(P401=\"\",$V$407-SUM(OFFSET($V$385:V399,0,0,COUNTA($V$385:V399),1)),ROUND(S400*(1+BDI.Taxa),2))","v":0},null,{"$f":"IF(P401=\"\",$X$407-SUM(OFFSET($X$385:X399,0,0,COUNTA($X$385:X399),1)),ROUND(V400*100/ORÇAMENTO.Totalorçamento,2))","v":{"$error":"#DIV/0!"}}]
[null,null,null,null,null,null,null,null,null,null,null,null,null,null,"16.","",null,null,{"$f":"IF(P402=\"\",$S$407-SUM(OFFSET($S$385:S400,0,0,COUNTA($S$385:S400),1)),SUMIF($R$20:$R$333,$P401,$W$20:$W$333))","v":0},null,null,{"$f":"IF(P402=\"\",$V$407-SUM(OFFSET($V$385:V400,0,0,COUNTA($V$385:V400),1)),ROUND(S401*(1+BDI.Taxa),2))","v":0},null,{"$f":"IF(P402=\"\",$X$407-SUM(OFFSET($X$385:X400,0,0,COUNTA($X$385:X400),1)),ROUND(V401*100/ORÇAMENTO.Totalorçamento,2))","v":{"$error":"#DIV/0!"}}]
[null,null,null,null,null,null,null,null,null,null,null,null,null,null,"17.","",null,null,{"$f":"IF(P403=\"\",$S$407-SUM(OFFSET($S$385:S401,0,0,COUNTA($S$385:S401),1)),SUMIF($R$20:$R$333,$P402,$W$20:$W$333))","v":0},null,null,{"$f":"IF(P403=\"\",$V$407-SUM(OFFSET($V$385:V401,0,0,COUNTA($V$385:V401),1)),ROUND(S402*(1+BDI.Taxa),2))","v":0},null,{"$f":"IF(P403=\"\",$X$407-SUM(OFFSET($X$385:X401,0,0,COUNTA($X$385:X401),1)),ROUND(V402*100/ORÇAMENTO.Totalorçamento,2))","v":{"$error":"#DIV/0!"}}]
[null,null,null,null,null,null,null,null,null,null,null,null,null,null,"18.","",null,null,{"$f":"IF(P404=\"\",$S$407-SUM(OFFSET($S$385:S402,0,0,COUNTA($S$385:S402),1)),SUMIF($R$20:$R$333,$P403,$W$20:$W$333))","v":0},null,null,{"$f":"IF(P404=\"\",$V$407-SUM(OFFSET($V$385:V402,0,0,COUNTA($V$385:V402),1)),ROUND(S403*(1+BDI.Taxa),2))","v":0},null,{"$f":"IF(P404=\"\",$X$407-SUM(OFFSET($X$385:X402,0,0,COUNTA($X$385:X402),1)),ROUND(V403*100/ORÇAMENTO.Totalorçamento,2))","v":{"$error":"#DIV/0!"}}]
[null,null,null,null,null,null,null,null,null,null,null,null,null,null,"19.","",null,null,{"$f":"IF(P405=\"\",$S$407-SUM(OFFSET($S$385:S403,0,0,COUNTA($S$385:S403),1)),SUMIF($R$20:$R$333,$P404,$W$20:$W$333))","v":0},null,null,{"$f":"IF(P405=\"\",$V$407-SUM(OFFSET($V$385:V403,0,0,COUNTA($V$385:V403),1)),ROUND(S404*(1+BDI.Taxa),2))","v":0},null,{"$f":"IF(P405=\"\",$X$407-SUM(OFFSET($X$385:X403,0,0,COUNTA($X$385:X403),1)),ROUND(V404*100/ORÇAMENTO.Totalorçamento,2))","v":{"$error":"#DIV/0!"}}]
[null,null,null,null,null,null,null,null,null,null,null,null,null,null,"20.","",null,null,{"$f":"IF(P406=\"\",$S$407-SUM(OFFSET($S$385:S404,0,0,COUNTA($S$385:S404),1)),SUMIF($R$20:$R$333,$P405,$W$20:$W$333))","v":0},null,null,{"$f":"IF(P406=\"\",$V$407-SUM(OFFSET($V$385:V404,0,0,COUNTA($V$385:V404),1)),ROUND(S405*(1+BDI.Taxa),2))","v":0},null,{"$f":"IF(P406=\"\",$X$407-SUM(OFFSET($X$385:X404,0,0,COUNTA($X$385:X404),1)),ROUND(V405*100/ORÇAMENTO.Totalorçamento,2))","v":{"$error":"#DIV/0!"}}]
[null,null,null,null,null,null,null,null,null,null,null,null,null,null,"TOTAL GERAL DO ORÇAMENTO (R$)",null,null,null,{"$f":"SUM(S386:U405)","v":0},null,null,{"$f":"SUM(V386:W405)","v":0},null,{"$f":"SUM(X386:X405)","v":{"$error":"#DIV/0!"}}]
[null,null,null,null,null,null,null,null,null,null,null,null,null,null,null,null,null,null,{"$f":"$W$334","v":0},null,null,{"$f":"$W$336","v":0},null,100]
[null,null,null,null,null,null,null,null,null,null,null,null,null,null,null,null,null,null,"(TOTAL SEM BDI)",null,null,"(TOTAL COM BDI)",null,"(ARRED porcentagem)"]
[null,null,null,null,null,null,null,null,null,null,null,null,null,null,null,null,null,null,{"$f":"IF(AND(S406=S407,S406>0),\"OK\",\"ERRO\")","v":"ERRO"},null,null,{"$f":"IF(AND(V406=V407,V406>0),\"OK\",\"ERRO\")","v":"ERRO"},null,{"$f":"IF(AND(X406=100,S386<>0),\"OK\",\"ERRO\")","v":{"$error":"#DIV/0!"}}]

{"sheet":"Resumo ","index":1,"n_rows":39,"n_cols":9,"rows_kept":39,"cut":false,"hidden":false,"merged":[[42,3,42,7],[11,1,11,2],[12,1,12,2],[15,2,15,3],[16,2,16,3],[14,1,14,8],[17,2,17,3],[23,2,23,3],[18,2,18,3],[19,2,19,3],[20,2,20,3],[41,3,41,7],[24,2,24,3],[26,2,26,3],[27,2,27,3],[38,1,38,8],[1,1,1,8],[2,6,2,8],[3,6,3,8],[4,1,4,8],[5,6,5,8],[6,6,6,8],[7,1,7,8],[8,6,8,8],[9,6,9,8],[13,1,13,8],[0,1,0,8],[36,1,36,5],[2,1,2,5],[3,1,3,5],[5,1,5,5],[6,1,6,5],[8,1,8,5],[9,1,9,5],[11,3,11,5],[12,3,12,5],[10,1,10,8],[11,6,11,8],[12,6,12,8],[25,2,25,3],[21,2,21,3],[22,2,22,3],[13,0,14,0],[34,2,34,3],[35,2,35,3],[31,2,31,3],[32,2,32,3],[33,2,33,3],[28,2,28,3],[29,2,29,3],[30,2,30,3]]}
[]
[]
[null,"UNIDADE ESCOLAR",null,null,null,null,"CÓDIGO INEP"]
[null,{"$f":"Orçamento!$O$5","v":"COLÉGIO ESTADUAL DA POLÍCIA MILITAR DE GOIÁS DE FORMOSA - DOMINGOS DE OLIVEIRA"},null,null,null,null,{"$f":"Orçamento!V5","v":52046273}]
[]
[null,"OBRA",null,null,null,null,"CIDADE"]
[null,{"$f":"Orçamento!$O$8","v":"REFORMA E AMPLIAÇÃO"},null,null,null,null,{"$f":"Orçamento!$V$8","v":"FORMOSA"}]
[]
[null,"ENDEREÇO",null,null,null,null,"CRE"]
[null,{"$f":"Orçamento!$R$11","v":"Avenida Santa Bárbara S/Nº, Loteamento Santa Bárbara, CEP:73803-155"},null,null,null,null,{"$f":"Orçamento!$O$11","v":"FORMOSA"}]
[]
[null,"REFERÊNCIA",null,"DATA",null,null,"ÁREA TOTAL CONSTRUÍDA (M²)"]
[null,{"$f":"CONCATENATE(\"AGETOP E SINAPI - \",Orçamento!$T$11)","v":"AGETOP E SINAPI - ONERADA"},null,{"$f":"Orçamento!$S$8","v":"2020-04-02"},null,null,{"$f":"Orçamento!$V$14","v":2646.3}]
["FILTRO"]
[null,"RESUMO GERAL DO ORÇAMENTO"]
["↓","ITEM","DESCRIÇÃO DOS SERVIÇOS",null,"UNID","QUANT","PREÇO SEM BDI","PREÇO COM BDI","PARTICIP. (%)"]
[{"$f":"IF(H17>0,\"F\",\"\")","v":"F"},"1.",{"$f":"Orçamento!$P386","v":"REFORMA"},null,{"$f":"IF(C17<>\"\",\"UN\",\"\")","v":"UN"},{"$f":"IF(C17<>\"\",1,\"\")","v":1},{"$f":"IFERROR(Orçamento!S386,\"-\")","v":169788.31999999998},{"$f":"IFERROR(Orçamento!V386,\"\")","v":204330.84},{"$f":"Orçamento!X386","v":{"$error":"#DIV/0!"}}]
[{"$f":"IF(H18>0,\"F\",\"\")","v":""},"2.",{"$f":"Orçamento!$P387","v":"BLOCO 01 SALA DE AULA PADRÃO SEDUC 2017 - LAJE"},null,{"$f":"IF(C18<>\"\",\"UN\",\"\")","v":"UN"},{"$f":"IF(C18<>\"\",1,\"\")","v":1},{"$f":"IFERROR(Orçamento!S387,\"-\")","v":-169788.31999999998},{"$f":"IFERROR(Orçamento!V387,\"\")","v":-204330.84},{"$f":"Orçamento!X387","v":{"$error":"#DIV/0!"}}]
[{"$f":"IF(H19>0,\"F\",\"\")","v":""},"3.",{"$f":"Orçamento!$P388","v":""},null,"","",{"$f":"IFERROR(Orçamento!S388,\"-\")","v":0},{"$f":"IFERROR(Orçamento!V388,\"\")","v":0},{"$f":"Orçamento!X388","v":{"$error":"#DIV/0!"}}]
["","4.",{"$f":"Orçamento!$P389","v":""},null,"","",{"$f":"IFERROR(Orçamento!S389,\"-\")","v":0},{"$f":"IFERROR(Orçamento!V389,\"\")","v":0},{"$f":"Orçamento!X389","v":{"$error":"#DIV/0!"}}]
["","5.",{"$f":"Orçamento!$P390","v":""},null,"","",{"$f":"IFERROR(Orçamento!S390,\"-\")","v":0},{"$f":"IFERROR(Orçamento!V390,\"\")","v":0},{"$f":"Orçamento!X390","v":{"$error":"#DIV/0!"}}]
["","6.",{"$f":"Orçamento!$P391","v":""},null,"","",{"$f":"IFERROR(Orçamento!S391,\"-\")","v":0},{"$f":"IFERROR(Orçamento!V391,\"\")","v":0},{"$f":"Orçamento!X391","v":{"$error":"#DIV/0!"}}]
["","7.",{"$f":"Orçamento!$P392","v":""},null,"","",{"$f":"IFERROR(Orçamento!S392,\"-\")","v":0},{"$f":"IFERROR(Orçamento!V392,\"\")","v":0},{"$f":"Orçamento!X392","v":{"$error":"#DIV/0!"}}]
["","8.",{"$f":"Orçamento!$P393","v":""},null,"","",{"$f":"IFERROR(Orçamento!S393,\"-\")","v":0},{"$f":"IFERROR(Orçamento!V393,\"\")","v":0},{"$f":"Orçamento!X393","v":{"$error":"#DIV/0!"}}]
["","9.",{"$f":"Orçamento!$P394","v":""},null,"","",{"$f":"IFERROR(Orçamento!S394,\"-\")","v":0},{"$f":"IFERROR(Orçamento!V394,\"\")","v":0},{"$f":"Orçamento!X394","v":{"$error":"#DIV/0!"}}]
["","10.",{"$f":"Orçamento!$P395","v":""},null,"","",{"$f":"IFERROR(Orçamento!S395,\"-\")","v":0},{"$f":"IFERROR(Orçamento!V395,\"\")","v":0},{"$f":"Orçamento!X395","v":{"$error":"#DIV/0!"}}]
["","11.",{"$f":"Orçamento!$P396","v":""},null,"","",{"$f":"IFERROR(Orçamento!S396,\"-\")","v":0},{"$f":"IFERROR(Orçamento!V396,\"\")","v":0},{"$f":"Orçamento!X396","v":{"$error":"#DIV/0!"}}]
["","12.",{"$f":"Orçamento!$P397","v":""},null,"","",{"$f":"IFERROR(Orçamento!S397,\"-\")","v":0},{"$f":"IFERROR(Orçamento!V397,\"\")","v":0},{"$f":"Orçamento!X397","v":{"$error":"#DIV/0!"}}]
["","13.",{"$f":"Orçamento!$P398","v":""},null,"","",{"$f":"IFERROR(Orçamento!S398,\"-\")","v":0},{"$f":"IFERROR(Orçamento!V398,\"\")","v":0},{"$f":"Orçamento!X398","v":{"$error":"#DIV/0!"}}]
["","14.",{"$f":"Orçamento!$P399","v":""},null,"","",{"$f":"IFERROR(Orçamento!S399,\"-\")","v":0},{"$f":"IFERROR(Orçamento!V399,\"\")","v":0},{"$f":"Orçamento!X399","v":{"$error":"#DIV/0!"}}]
["","15.",{"$f":"Orçamento!$P400","v":""},null,"","",{"$f":"IFERROR(Orçamento!S400,\"-\")","v":0},{"$f":"IFERROR(Orçamento!V400,\"\")","v":0},{"$f":"Orçamento!X400","v":{"$error":"#DIV/0!"}}]
["","16.",{"$f":"Orçamento!$P401","v":""},null,"","",{"$f":"IFERROR(Orçamento!S401,\"-\")","v":0},{"$f":"IFERROR(Orçamento!V401,\"\")","v":0},{"$f":"Orçamento!X401","v":{"$error":"#DIV/0!"}}]
["","17.",{"$f":"Orçamento!$P402","v":""},null,"","",{"$f":"IFERROR(Orçamento!S402,\"-\")","v":0},{"$f":"IFERROR(Orçamento!V402,\"\")","v":0},{"$f":"Orçamento!X402","v":{"$error":"#DIV/0!"}}]
["","18.",{"$f":"Orçamento!$P403","v":""},null,"","",{"$f":"IFERROR(Orçamento!S403,\"-\")","v":0},{"$f":"IFERROR(Orçamento!V403,\"\")","v":0},{"$f":"Orçamento!X403","v":{"$error":"#DIV/0!"}}]
["","19.",{"$f":"Orçamento!$P404","v":""},null,"","",{"$f":"IFERROR(Orçamento!S404,\"-\")","v":0},{"$f":"IFERROR(Orçamento!V404,\"\")","v":0},{"$f":"Orçamento!X404","v":{"$error":"#DIV/0!"}}]
["","20.",{"$f":"Orçamento!$P405","v":""},null,"","",{"$f":"IFERROR(Orçamento!S405,\"-\")","v":0},{"$f":"IFERROR(Orçamento!V405,\"\")","v":0},{"$f":"Orçamento!X405","v":{"$error":"#DIV/0!"}}]
["F","TOTAL GERAL DO ORÇAMENTO (R$)",null,null,null,null,{"$f":"SUM(G17:G36)","v":0},{"$f":"SUM(H17:H36)","v":0},{"$f":"SUM(I17:I36)","v":{"$error":"#DIV/0!"}}]
["F"]
["F"]

{"sheet":"Somatório","index":2,"n_rows":45,"n_cols":6,"rows_kept":45,"cut":false,"hidden":false,"merged":[[0,1,0,5],[14,1,14,5],[2,1,2,3],[2,4,2,5],[3,1,3,3],[3,4,3,5],[5,1,5,3],[5,4,5,5],[6,1,6,3],[6,4,6,5],[8,1,8,3],[8,4,8,5],[1,1,1,5],[4,1,4,5],[7,1,7,5],[10,1,10,5],[9,1,9,3],[9,4,9,5],[11,1,11,2],[11,4,11,5],[12,1,12,2],[12,4,12,5],[13,0,14,0],[42,1,42,2],[44,1,44,5],[47,3,47,5],[48,3,48,5],[13,1,13,5]]}
[]
[]
[null,"UNIDADE ESCOLAR",null,null,"CÓDIGO INEP"]
[null,{"$f":"Orçamento!$O$5","v":"COLÉGIO ESTADUAL DA POLÍCIA MILITAR DE GOIÁS DE FORMOSA - DOMINGOS DE OLIVEIRA"},null,null,{"$f":"Orçamento!V5","v":52046273}]
[]
[null,"OBRA",null,null,"CIDADE"]
[null,{"$f":"Orçamento!$O$8","v":"REFORMA E AMPLIAÇÃO"},null,null,{"$f":"Orçamento!$V$8","v":"FORMOSA"}]
[]
[null,"ENDEREÇO",null,null,"CRE"]
[null,{"$f":"Orçamento!$R$11","v":"Avenida Santa Bárbara S/Nº, Loteamento Santa Bárbara, CEP:73803-155"},null,null,{"$f":"Orçamento!$O$11","v":"FORMOSA"}]
[]
[null,"REFERÊNCIA",null,"DATA","ÁREA TOTAL CONSTRUÍDA (M²)"]
[null,{"$f":"CONCATENATE(\"AGETOP E SINAPI - \",Orçamento!$T$11)","v":"AGETOP E SINAPI - ONERADA"},null,{"$f":"Orçamento!$S$8","v":"2020-04-02"},{"$f":"Orçamento!$V$14","v":2646.3}]
["FILTRO"]
[null,"SOMATÓRIO DE SERVIÇOS"]
["↓","ITEM","DESCRIÇÃO DOS SERVIÇOS","PREÇO SEM BDI (R$)","PREÇO COM BDI (R$)","PARTIC.  ( % )"]
[{"$f":"IF(D17>0,\"F\",\"\")","v":""},"a.",{"$f":"Orçamento!P352","v":"SERVIÇOS PRELIMINARES"},{"$f":"Orçamento!S352","v":0},{"$f":"Orçamento!V352","v":0},{"$f":"Orçamento!X352","v":0}]
[{"$f":"IF(D18>0,\"F\",\"\")","v":""},"b.",{"$f":"Orçamento!P353","v":"TRANSPORTES"},{"$f":"Orçamento!S353","v":0},{"$f":"Orçamento!V353","v":0},{"$f":"Orçamento!X353","v":0}]
["","c.",{"$f":"Orçamento!P354","v":"SERVIÇO EM TERRA"},{"$f":"Orçamento!S354","v":0},{"$f":"Orçamento!V354","v":0},{"$f":"Orçamento!X354","v":0}]
["","d.",{"$f":"Orçamento!P355","v":"FUNDAÇÕES E SONDAGENS"},{"$f":"Orçamento!S355","v":0},{"$f":"Orçamento!V355","v":0},{"$f":"Orçamento!X355","v":0}]
["","e.",{"$f":"Orçamento!P356","v":"ESTRUTURA"},{"$f":"Orçamento!S356","v":0},{"$f":"Orçamento!V356","v":0},{"$f":"Orçamento!X356","v":0}]
["","f.",{"$f":"Orçamento!P357","v":"INSTALAÇÕES ELÉTRICAS"},{"$f":"Orçamento!S357","v":0},{"$f":"Orçamento!V357","v":0},{"$f":"Orçamento!X357","v":0}]
["","g.",{"$f":"Orçamento!P358","v":"INSTALAÇÕES HIDROSSANITÁRIAS"},{"$f":"Orçamento!S358","v":0},{"$f":"Orçamento!V358","v":0},{"$f":"Orçamento!X358","v":0}]
["","h.",{"$f":"Orçamento!P359","v":"INSTALAÇÕES ESPECIAIS"},{"$f":"Orçamento!S359","v":0},{"$f":"Orçamento!V359","v":0},{"$f":"Orçamento!X359","v":0}]
["","i.",{"$f":"Orçamento!P360","v":"ALVENARIAS E DIVISÓRIAS"},{"$f":"Orçamento!S360","v":0},{"$f":"Orçamento!V360","v":0},{"$f":"Orçamento!X360","v":0}]
["","j.",{"$f":"Orçamento!P361","v":"ALVENARIA AUTO-PORTANTE"},{"$f":"Orçamento!S361","v":0},{"$f":"Orçamento!V361","v":0},{"$f":"Orçamento!X361","v":0}]
["","k.",{"$f":"Orçamento!P362","v":"IMPERMEABILIZAÇÃO"},{"$f":"Orçamento!S362","v":0},{"$f":"Orçamento!V362","v":0},{"$f":"Orçamento!X362","v":0}]
["","l.",{"$f":"Orçamento!P363","v":"ISOLAMENTO TÉRMICO E ACÚSTICO"},{"$f":"Orçamento!S363","v":0},{"$f":"Orçamento!V363","v":0},{"$f":"Orçamento!X363","v":0}]
["","m.",{"$f":"Orçamento!P364","v":"ESTRUTURA DE MADEIRA"},{"$f":"Orçamento!S364","v":0},{"$f":"Orçamento!V364","v":0},{"$f":"Orçamento!X364","v":0}]
["","n.",{"$f":"Orçamento!P365","v":"ESTRUTURAS METÁLICAS"},{"$f":"Orçamento!S365","v":0},{"$f":"Orçamento!V365","v":0},{"$f":"Orçamento!X365","v":0}]
["","o.",{"$f":"Orçamento!P366","v":"COBERTURAS"},{"$f":"Orçamento!S366","v":0},{"$f":"Orçamento!V366","v":0},{"$f":"Orçamento!X366","v":0}]
["","p.",{"$f":"Orçamento!P367","v":"ESQUADRIAS DE MADEIRA"},{"$f":"Orçamento!S367","v":0},{"$f":"Orçamento!V367","v":0},{"$f":"Orçamento!X367","v":0}]
["","q.",{"$f":"Orçamento!P368","v":"ESQUADRIAS METÁLICAS"},{"$f":"Orçamento!S368","v":0},{"$f":"Orçamento!V368","v":0},{"$f":"Orçamento!X368","v":0}]
["","r.",{"$f":"Orçamento!P369","v":"VIDROS"},{"$f":"Orçamento!S369","v":0},{"$f":"Orçamento!V369","v":0},{"$f":"Orçamento!X369","v":0}]
["","s.",{"$f":"Orçamento!P370","v":"REVESTIMENTO DE PAREDE"},{"$f":"Orçamento!S370","v":0},{"$f":"Orçamento!V370","v":0},{"$f":"Orçamento!X370","v":0}]
["","t.",{"$f":"Orçamento!P371","v":"FORROS"},{"$f":"Orçamento!S371","v":0},{"$f":"Orçamento!V371","v":0},{"$f":"Orçamento!X371","v":0}]
["","u.",{"$f":"Orçamento!P372","v":"REVESTIMENTO DE PISO"},{"$f":"Orçamento!S372","v":0},{"$f":"Orçamento!V372","v":0},{"$f":"Orçamento!X372","v":0}]
["","v.",{"$f":"Orçamento!P373","v":"FERRAGENS"},{"$f":"Orçamento!S373","v":0},{"$f":"Orçamento!V373","v":0},{"$f":"Orçamento!X373","v":0}]
["","w.",{"$f":"Orçamento!P374","v":"MARCENARIA"},{"$f":"Orçamento!S374","v":0},{"$f":"Orçamento!V374","v":0},{"$f":"Orçamento!X374","v":0}]
["","x.",{"$f":"Orçamento!P375","v":"ADMINISTRAÇÃO"},{"$f":"Orçamento!S375","v":0},{"$f":"Orçamento!V375","v":0},{"$f":"Orçamento!X375","v":0}]
["","y.",{"$f":"Orçamento!P376","v":"PINTURA"},{"$f":"Orçamento!S376","v":0},{"$f":"Orçamento!V376","v":0},{"$f":"Orçamento!X376","v":0}]
["","z.",{"$f":"Orçamento!P377","v":"DIVERSOS"},{"$f":"Orçamento!S377","v":0},{"$f":"Orçamento!V377","v":0},{"$f":"Orçamento!X377","v":0}]
["F","TOTAL GERAL DO ORÇAMENTO",null,{"$f":"SUM(D17:D42)","v":0},{"$f":"SUM(E17:E42)","v":0},{"$f":"SUM(F17:F42)","v":0}]
[]
[null,"(*) Para itens da AGETOP, os vidros não estão inclusos nas esquadrias e já foram considerados os custos de contramarco para as esquadrias de alumínio;"]

{"sheet":"Cronog_90_Dias","index":3,"n_rows":99,"n_cols":20,"rows_kept":99,"cut":false,"hidden":false,"merged":[[97,1,97,4],[98,1,98,17],[94,1,94,2],[94,5,94,8],[94,9,94,12],[94,13,94,16],[95,1,95,2],[95,5,95,8],[95,9,95,12],[95,13,95,16],[92,1,92,2],[92,5,92,8],[92,9,92,12],[92,13,92,16],[93,1,93,2],[93,5,93,8],[93,9,93,12],[93,13,93,16],[89,1,91,2],[89,3,91,3],[89,4,91,4],[89,5,89,8],[89,9,89,12],[89,13,89,16],[91,5,91,8],[91,9,91,12],[91,13,91,16],[86,1,88,2],[86,3,88,3],[86,4,88,4],[86,5,86,8],[86,9,86,12],[86,13,86,16],[88,5,88,8],[88,9,88,12],[88,13,88,16],[83,1,85,2],[83,3,85,3],[83,4,85,4],[83,5,83,8],[83,9,83,12],[83,13,83,16],[85,5,85,8],[85,9,85,12],[85,13,85,16],[80,1,82,2],[80,3,82,3],[80,4,82,4],[80,5,80,8],[80,9,80,12],[80,13,80,16],[82,5,82,8],[82,9,82,12],[82,13,82,16],[77,1,79,2],[77,3,79,3],[77,4,79,4],[77,5,77,8],[77,9,77,12],[77,13,77,16],[79,5,79,8],[79,9,79,12],[79,13,79,16],[74,1,76,2],[74,3,76,3],[74,4,76,4],[74,5,74,8],[74,9,74,12],[74,13,74,16],[76,5,76,8],[76,9,76,12],[76,13,76,16],[71,1,73,2],[71,3,73,3],[71,4,73,4],[71,5,71,8],[71,9,71,12],[71,13,71,16],[73,5,73,8],[73,9,73,12],[73,13,73,16],[68,1,70,2],[68,3,70,3],[68,4,70,4],[68,5,68,8],[68,9,68,12],[68,13,68,16],[70,5,70,8],[70,9,70,12],[70,13,70,16],[65,1,67,2],[65,3,67,3],[65,4,67,4],[65,5,65,8],[65,9,65,12],[65,13,65,16],[67,5,67,8],[67,9,67,12],[67,13,67,16],[62,1,64,2],[62,3,64,3],[62,4,64,4],[62,5,62,8],[62,9,62,12],[62,13,62,16],[64,5,64,8],[64,9,64,12],[64,13,64,16],[59,1,61,2],[59,3,61,3],[59,4,61,4],[59,5,59,8],[59,9,59,12],[59,13,59,16],[61,5,61,8],[61,9,61,12],[61,13,61,16],[56,1,58,2],[56,3,58,3],[56,4,58,4],[56,5,56,8],[56,9,56,12],[56,13,56,16],[58,5,58,8],[58,9,58,12],[58,13,58,16],[53,1,55,2],[53,3,55,3],[53,4,55,4],[53,5,53,8],[53,9,53,12],[53,13,53,16],[55,5,55,8],[55,9,55,12],[55,13,55,16],[50,1,52,2],[50,3,52,3],[50,4,52,4],[50,5,50,8],[50,9,50,12],[50,13,50,16],[52,5,52,8],[52,9,52,12],[52,13,52,16],[47,1,49,2],[47,3,49,3],[47,4,49,4],[47,5,47,8],[47,9,47,12],[47,13,47,16],[49,5,49,8],[49,9,49,12],[49,13,49,16],[44,1,46,2],[44,3,46,3],[44,4,46,4],[44,5,44,8],[44,9,44,12],[44,13,44,16],[46,5,46,8],[46,9,46,12],[46,13,46,16],[41,1,43,2],[41,3,43,3],[41,4,43,4],[41,5,41,8],[41,9,41,12],[41,13,41,16],[43,5,43,8],[43,9,43,12],[43,13,43,16],[38,1,40,2],[38,3,40,3],[38,4,40,4],[38,5,38,8],[38,9,38,12],[38,13,38,16],[40,5,40,8],[40,9,40,12],[40,13,40,16],[35,1,37,2],[35,3,37,3],[35,4,37,4],[35,5,35,8],[35,9,35,12],[35,13,35,16],[37,5,37,8],[37,9,37,12],[37,13,37,16],[32,1,34,2],[32,3,34,3],[32,4,34,4],[32,5,32,8],[32,9,32,12],[32,13,32,16],[34,5,34,8],[34,9,34,12],[34,13,34,16],[29,1,31,2],[29,3,31,3],[29,4,31,4],[29,5,29,8],[29,9,29,12],[29,13,29,16],[31,5,31,8],[31,9,31,12],[31,13,31,16],[26,1,28,2],[26,3,28,3],[26,4,28,4],[26,5,26,8],[26,9,26,12],[26,13,26,16],[28,5,28,8],[28,9,28,12],[28,13,28,16],[23,1,25,2],[23,3,25,3],[23,4,25,4],[23,5,23,8],[23,9,23,12],[23,13,23,16],[25,5,25,8],[25,9,25,12],[25,13,25,16],[20,1,22,2],[20,3,22,3],[20,4,22,4],[20,5,20,8],[20,9,20,12],[20,13,20,16],[22,5,22,8],[22,9,22,12],[22,13,22,16],[17,1,19,2],[17,3,19,3],[17,4,19,4],[17,5,17,8],[17,9,17,12],[17,13,17,16],[19,5,19,8],[19,9,19,12],[19,13,19,16],[14,1,16,2],[14,3,16,3],[14,4,16,4],[14,5,14,8],[14,9,14,12],[14,13,14,16],[16,5,16,8],[16,9,16,12],[16,13,16,16],[12,0,13,0],[12,3,13,3],[12,5,12,8],[12,9,12,12],[12,13,12,16],[12,17,13,17],[13,1,13,2],[13,5,13,8],[13,9,13,12],[13,13,13,16],[0,1,0,17],[1,1,1,17],[2,1,2,7],[2,8,2,17],[3,1,3,7],[3,8,3,17],[8,1,8,7],[8,8,8,17],[9,0,11,0],[9,1,9,7],[9,8,9,17],[10,1,10,17],[11,1,11,17],[4,1,4,17],[5,1,5,7],[5,8,5,17],[6,1,6,7],[6,8,6,17],[7,1,7,17]]}
[]
[]
[null,"UNIDADE ESCOLAR",null,null,null,null,null,null,"PRAZO"]
[null,{"$f":"Orçamento!O5","v":"COLÉGIO ESTADUAL DA POLÍCIA MILITAR DE GOIÁS DE FORMOSA - DOMINGOS DE OLIVEIRA"},null,null,null,null,null,null,"90 DIAS CORRIDOS"]
[]
[null,"OBRA",null,null,null,null,null,null,"DATA"]
[null,{"$f":"Orçamento!O8","v":"REFORMA E AMPLIAÇÃO"},null,null,null,null,null,null,{"$f":"Orçamento!S8","v":"2020-04-02"}]
[]
[null,"LOCAL",null,null,null,null,null,null,"ÁREA TOTAL CONSTRUÍDA (M²)"]
["FILTRO",{"$f":"Orçamento!V8","v":"FORMOSA"},null,null,null,null,null,null,{"$f":"Orçamento!V14","v":2646.3}]
[]
[null,"CRONOGRAMA - FÍSICO FINANCEIRO"]
["↓","CUSTO TOTAL:",{"$f":"D93","v":0},"VALOR","Dias:",30,null,null,null,60,null,null,null,90,null,null,null,"TOTAL"]
[null,"DESCRIÇÃO DOS SERVIÇOS",null,null,"%","1ª PARCELA",null,null,null,"2ª PARCELA",null,null,null,"3ª PARCELA"]
[{"$f":"IF(D15>0,\"F\",\"\")","v":""},"SERVIÇOS PRELIMINARES",null,{"$f":"Orçamento!V352","v":0},{"$f":"Orçamento!X352","v":0},{"$f":"ROUND(F17*$D$15,2)","v":0},null,null,null,{"$f":"ROUND(J17*$D$15,2)","v":0},null,null,null,{"$f":"ROUND(N17*$D$15,2)","v":0},null,null,null,{"$f":"SUM(F15:Q15)","v":0},null,{"$f":"IF(D15=R15,\"OK\",\"ERRO\")","v":"OK"}]
[{"$f":"IF(A15=\"F\",A15,\"\")","v":""}]
[{"$f":"IF(A16=\"F\",A16,\"\")","v":""},null,null,null,null,1,null,null,null,0,null,null,null,{"$f":"1-F17-J17","v":0},null,null,null,{"$f":"IFERROR(E15/100,\"\")","v":0},null,{"$f":"IF(E15=R17*100,\"OK\",\"ERRO\")","v":"OK"}]
[{"$f":"IF(D18>0,\"F\",\"\")","v":""},"TRANSPORTES",null,{"$f":"Orçamento!V353","v":0},{"$f":"Orçamento!X353","v":0},{"$f":"ROUND(F20*$D$18,2)","v":0},null,null,null,{"$f":"ROUND(J20*$D$18,2)","v":0},null,null,null,{"$f":"ROUND(N20*$D$18,2)","v":0},null,null,null,{"$f":"SUM(F18:Q18)","v":0},null,{"$f":"IF(D18=R18,\"OK\",\"ERRO\")","v":"OK"}]
[{"$f":"IF(A18=\"F\",A18,\"\")","v":""}]
[{"$f":"IF(A19=\"F\",A19,\"\")","v":""},null,null,null,null,0.37,null,null,null,0.3,null,null,null,{"$f":"1-F20-J20","v":0.33},null,null,null,{"$f":"IFERROR(E18/100,\"\")","v":0},null,{"$f":"IF(E18=R20*100,\"OK\",\"ERRO\")","v":"OK"}]
[{"$f":"IF(D21>0,\"F\",\"\")","v":""},"SERVIÇO EM TERRA",null,{"$f":"Orçamento!V354","v":0},{"$f":"Orçamento!X354","v":0},{"$f":"ROUND(F23*$D$21,2)","v":0},null,null,null,{"$f":"ROUND(J23*$D$21,2)","v":0},null,null,null,{"$f":"ROUND(N23*$D$21,2)","v":0},null,null,null,{"$f":"SUM(F21:Q21)","v":0},null,{"$f":"IF(D21=R21,\"OK\",\"ERRO\")","v":"OK"}]
[{"$f":"IF(A21=\"F\",A21,\"\")","v":""}]
[{"$f":"IF(A22=\"F\",A22,\"\")","v":""},null,null,null,null,1,null,null,null,0,null,null,null,{"$f":"1-F23-J23","v":0},null,null,null,{"$f":"IFERROR(E21/100,\"\")","v":0},null,{"$f":"IF(E21=R23*100,\"OK\",\"ERRO\")","v":"OK"}]
[{"$f":"IF(D24>0,\"F\",\"\")","v":""},"FUNDAÇÕES E SONDAGENS",null,{"$f":"Orçamento!V355","v":0},{"$f":"Orçamento!X355","v":0},{"$f":"ROUND(F26*$D$24,2)","v":0},null,null,null,{"$f":"ROUND(J26*$D$24,2)","v":0},null,null,null,{"$f":"ROUND(N26*$D$24,2)","v":0},null,null,null,{"$f":"SUM(F24:Q24)","v":0},null,{"$f":"IF(D24=R24,\"OK\",\"ERRO\")","v":"OK"}]
[{"$f":"IF(A24=\"F\",A24,\"\")","v":""}]
[{"$f":"IF(A25=\"F\",A25,\"\")","v":""},null,null,null,null,1,null,null,null,0,null,null,null,{"$f":"1-F26-J26","v":0},null,null,null,{"$f":"IFERROR(E24/100,\"\")","v":0},null,{"$f":"IF(E24=R26*100,\"OK\",\"ERRO\")","v":"OK"}]
[{"$f":"IF(D27>0,\"F\",\"\")","v":""},"ESTRUTURA",null,{"$f":"Orçamento!V356","v":0},{"$f":"Orçamento!X356","v":0},{"$f":"ROUND(F29*$D$27,2)","v":0},null,null,null,{"$f":"ROUND(J29*$D$27,2)","v":0},null,null,null,{"$f":"ROUND(N29*$D$27,2)","v":0},null,null,null,{"$f":"SUM(F27:Q27)","v":0},null,{"$f":"IF(D27=R27,\"OK\",\"ERRO\")","v":"OK"}]
[{"$f":"IF(A27=\"F\",A27,\"\")","v":""}]
[{"$f":"IF(A28=\"F\",A28,\"\")","v":""},null,null,null,null,0.54,null,null,null,0.46,null,null,null,{"$f":"1-F29-J29","v":0},null,null,null,{"$f":"IFERROR(E27/100,\"\")","v":0},null,{"$f":"IF(E27=R29*100,\"OK\",\"ERRO\")","v":"OK"}]
[{"$f":"IF(D30>0,\"F\",\"\")","v":""},"INST.ELET/TELEFÔNICA/CABEAMENTO ESTRUTURADO",null,{"$f":"Orçamento!V357","v":0},{"$f":"Orçamento!X357","v":0},{"$f":"ROUND(F32*$D$30,2)","v":0},null,null,null,{"$f":"ROUND(J32*$D$30,2)","v":0},null,null,null,{"$f":"ROUND(N32*$D$30,2)","v":0},null,null,null,{"$f":"SUM(F30:Q30)","v":0},null,{"$f":"IF(D30=R30,\"OK\",\"ERRO\")","v":"OK"}]
[{"$f":"IF(A30=\"F\",A30,\"\")","v":""}]
[{"$f":"IF(A31=\"F\",A31,\"\")","v":""},null,null,null,null,0,null,null,null,{"$f":"1-B32","v":1},null,null,null,{"$f":"1-F32-J32","v":0},null,null,null,{"$f":"IFERROR(E30/100,\"\")","v":0},null,{"$f":"IF(E30=R32*100,\"OK\",\"ERRO\")","v":"OK"}]
[{"$f":"IF(D33>0,\"F\",\"\")","v":""},"INSTALAÇÕES HIDROSSANITÁRIAS",null,{"$f":"Orçamento!V358","v":0},{"$f":"Orçamento!X358","v":0},{"$f":"ROUND(F35*$D$33,2)","v":0},null,null,null,{"$f":"ROUND(J35*$D$33,2)","v":0},null,null,null,{"$f":"ROUND(N35*$D$33,2)","v":0},null,null,null,{"$f":"SUM(F33:Q33)","v":0},null,{"$f":"IF(D33=R33,\"OK\",\"ERRO\")","v":"OK"}]
[{"$f":"IF(A33=\"F\",A33,\"\")","v":""}]
[{"$f":"IF(A34=\"F\",A34,\"\")","v":""},null,null,null,null,0,null,null,null,{"$f":"1-B35","v":1},null,null,null,{"$f":"1-F35-J35","v":0},null,null,null,{"$f":"IFERROR(E33/100,\"\")","v":0},null,{"$f":"IF(E33=R35*100,\"OK\",\"ERRO\")","v":"OK"}]
[{"$f":"IF(D36>0,\"F\",\"\")","v":""},"INSTALAÇÕES ESPECIAIS",null,{"$f":"Orçamento!V359","v":0},{"$f":"Orçamento!X359","v":0},{"$f":"ROUND(F38*$D$36,2)","v":0},null,null,null,{"$f":"ROUND(J38*$D$36,2)","v":0},null,null,null,{"$f":"ROUND(N38*$D$36,2)","v":0},null,null,null,{"$f":"SUM(F36:Q36)","v":0},null,{"$f":"IF(D36=R36,\"OK\",\"ERRO\")","v":"OK"}]
[{"$f":"IF(A36=\"F\",A36,\"\")","v":""}]
[{"$f":"IF(A37=\"F\",A37,\"\")","v":""},null,null,null,null,0,null,null,null,{"$f":"1-B38","v":1},null,null,null,{"$f":"1-F38-J38","v":0},null,null,null,{"$f":"IFERROR(E36/100,\"\")","v":0},null,{"$f":"IF(E36=R38*100,\"OK\",\"ERRO\")","v":"OK"}]
[{"$f":"IF(D39>0,\"F\",\"\")","v":""},"ALVENARIA E DIVISÓRIAS",null,{"$f":"Orçamento!V360","v":0},{"$f":"Orçamento!X360","v":0},{"$f":"ROUND(F41*$D$39,2)","v":0},null,null,null,{"$f":"ROUND(J41*$D$39,2)","v":0},null,null,null,{"$f":"ROUND(N41*$D$39,2)","v":0},null,null,null,{"$f":"SUM(F39:Q39)","v":0},null,{"$f":"IF(D39=R39,\"OK\",\"ERRO\")","v":"OK"}]
[{"$f":"IF(A39=\"F\",A39,\"\")","v":""}]
[{"$f":"IF(A40=\"F\",A40,\"\")","v":""},null,null,null,null,0,null,null,null,{"$f":"1-B41","v":1},null,null,null,{"$f":"1-F41-J41","v":0},null,null,null,{"$f":"IFERROR(E39/100,\"\")","v":0},null,{"$f":"IF(E39=R41*100,\"OK\",\"ERRO\")","v":"OK"}]
[{"$f":"IF(D42>0,\"F\",\"\")","v":""},"ALVENARIA AUTO-PORTANTE",null,{"$f":"Orçamento!V361","v":0},{"$f":"Orçamento!X361","v":0},{"$f":"ROUND(F44*$D$42,2)","v":0},null,null,null,{"$f":"ROUND(J44*$D$42,2)","v":0},null,null,null,{"$f":"ROUND(N44*$D$42,2)","v":0},null,null,null,{"$f":"SUM(F42:Q42)","v":0},null,{"$f":"IF(D42=R42,\"OK\",\"ERRO\")","v":"OK"}]
[{"$f":"IF(A42=\"F\",A42,\"\")","v":""}]
[{"$f":"IF(A43=\"F\",A43,\"\")","v":""},null,null,null,null,0,null,null,null,{"$f":"1-B44","v":1},null,null,null,{"$f":"1-F44-J44","v":0},null,null,null,{"$f":"IFERROR(E42/100,\"\")","v":0},null,{"$f":"IF(E42=R44*100,\"OK\",\"ERRO\")","v":"OK"}]
[{"$f":"IF(D45>0,\"F\",\"\")","v":""},"IMPERMEABILIZAÇÃO",null,{"$f":"Orçamento!V362","v":0},{"$f":"Orçamento!X362","v":0},{"$f":"ROUND(F47*$D$45,2)","v":0},null,null,null,{"$f":"ROUND(J47*$D$45,2)","v":0},null,null,null,{"$f":"ROUND(N47*$D$45,2)","v":0},null,null,null,{"$f":"SUM(F45:Q45)","v":0},null,{"$f":"IF(D45=R45,\"OK\",\"ERRO\")","v":"OK"}]
[{"$f":"IF(A45=\"F\",A45,\"\")","v":""}]
[{"$f":"IF(A46=\"F\",A46,\"\")","v":""},null,null,null,null,0.85,null,null,null,0.15,null,null,null,{"$f":"1-F47-J47","v":0},null,null,null,{"$f":"IFERROR(E45/100,\"\")","v":0},null,{"$f":"IF(E45=R47*100,\"OK\",\"ERRO\")","v":"OK"}]
[{"$f":"IF(D48>0,\"F\",\"\")","v":""},"ISOLAMENTO TÉRMICO E ACÚSTICO",null,{"$f":"Orçamento!V363","v":0},{"$f":"Orçamento!X363","v":0},{"$f":"ROUND(F50*$D$48,2)","v":0},null,null,null,{"$f":"ROUND(J50*$D$48,2)","v":0},null,null,null,{"$f":"ROUND(N50*$D$48,2)","v":0},null,null,null,{"$f":"SUM(F48:Q48)","v":0},null,{"$f":"IF(D48=R48,\"OK\",\"ERRO\")","v":"OK"}]
[{"$f":"IF(A48=\"F\",A48,\"\")","v":""}]
[{"$f":"IF(A49=\"F\",A49,\"\")","v":""},null,null,null,null,0,null,null,null,{"$f":"1-B50","v":1},null,null,null,{"$f":"1-F50-J50","v":0},null,null,null,{"$f":"IFERROR(E48/100,\"\")","v":0},null,{"$f":"IF(E48=R50*100,\"OK\",\"ERRO\")","v":"OK"}]
[{"$f":"IF(D51>0,\"F\",\"\")","v":""},"ESTRUTURA DE MADEIRA",null,{"$f":"Orçamento!V364","v":0},{"$f":"Orçamento!X364","v":0},{"$f":"ROUND(F53*$D$51,2)","v":0},null,null,null,{"$f":"ROUND(J53*$D$51,2)","v":0},null,null,null,{"$f":"ROUND(N53*$D$51,2)","v":0},null,null,null,{"$f":"SUM(F51:Q51)","v":0},null,{"$f":"IF(D51=R51,\"OK\",\"ERRO\")","v":"OK"}]
[{"$f":"IF(A51=\"F\",A51,\"\")","v":""}]
[{"$f":"IF(A52=\"F\",A52,\"\")","v":""},null,null,null,null,0,null,null,null,0.57999999999999996,null,null,null,{"$f":"1-F53-J53","v":0.42000000000000004},null,null,null,{"$f":"IFERROR(E51/100,\"\")","v":0},null,{"$f":"IF(E51=R53*100,\"OK\",\"ERRO\")","v":"OK"}]
[{"$f":"IF(D54>0,\"F\",\"\")","v":""},"ESTRUTURA METÁLICA",null,{"$f":"Orçamento!V365","v":0},{"$f":"Orçamento!X365","v":0},{"$f":"ROUND(F56*$D$54,2)","v":0},null,null,null,{"$f":"ROUND(J56*$D$54,2)","v":0},null,null,null,{"$f":"ROUND(N56*$D$54,2)","v":0},null,null,null,{"$f":"SUM(F54:Q54)","v":0},null,{"$f":"IF(D54=R54,\"OK\",\"ERRO\")","v":"OK"}]
[{"$f":"IF(A54=\"F\",A54,\"\")","v":""}]
[{"$f":"IF(A55=\"F\",A55,\"\")","v":""},null,null,null,null,0,null,null,null,0.57999999999999996,null,null,null,{"$f":"1-F56-J56","v":0.42000000000000004},null,null,null,{"$f":"IFERROR(E54/100,\"\")","v":0},null,{"$f":"IF(E54=R56*100,\"OK\",\"ERRO\")","v":"OK"}]
[{"$f":"IF(D57>0,\"F\",\"\")","v":""},"COBERTURAS",null,{"$f":"Orçamento!V366","v":0},{"$f":"Orçamento!X366","v":0},{"$f":"ROUND(F59*$D$57,2)","v":0},null,null,null,{"$f":"ROUND(J59*$D$57,2)","v":0},null,null,null,{"$f":"ROUND(N59*$D$57,2)","v":0},null,null,null,{"$f":"SUM(F57:Q57)","v":0},null,{"$f":"IF(D57=R57,\"OK\",\"ERRO\")","v":"OK"}]
[{"$f":"IF(A57=\"F\",A57,\"\")","v":""}]
[{"$f":"IF(A58=\"F\",A58,\"\")","v":""},null,null,null,null,0,null,null,null,0,null,null,null,{"$f":"1-F59-J59","v":1},null,null,null,{"$f":"IFERROR(E57/100,\"\")","v":0},null,{"$f":"IF(E57=R59*100,\"OK\",\"ERRO\")","v":"OK"}]
[{"$f":"IF(D60>0,\"F\",\"\")","v":""},"ESQUADRIAS DE MADEIRA",null,{"$f":"Orçamento!V367","v":0},{"$f":"Orçamento!X367","v":0},{"$f":"ROUND(F62*$D$60,2)","v":0},null,null,null,{"$f":"ROUND(J62*$D$60,2)","v":0},null,null,null,{"$f":"ROUND(N62*$D$60,2)","v":0},null,null,null,{"$f":"SUM(F60:Q60)","v":0},null,{"$f":"IF(D60=R60,\"OK\",\"ERRO\")","v":"OK"}]
[{"$f":"IF(A60=\"F\",A60,\"\")","v":""}]
[{"$f":"IF(A61=\"F\",A61,\"\")","v":""},null,null,null,null,0,null,null,null,0.4,null,null,null,{"$f":"1-F62-J62","v":0.6},null,null,null,{"$f":"IFERROR(E60/100,\"\")","v":0},null,{"$f":"IF(E60=R62*100,\"OK\",\"ERRO\")","v":"OK"}]
[{"$f":"IF(D63>0,\"F\",\"\")","v":""},"ESQUADRIAS METÁLICAS",null,{"$f":"Orçamento!V368","v":0},{"$f":"Orçamento!X368","v":0},{"$f":"ROUND(F65*$D$63,2)","v":0},null,null,null,{"$f":"ROUND(J65*$D$63,2)","v":0},null,null,null,{"$f":"ROUND(N65*$D$63,2)","v":0},null,null,null,{"$f":"SUM(F63:Q63)","v":0},null,{"$f":"IF(D63=R63,\"OK\",\"ERRO\")","v":"OK"}]
[{"$f":"IF(A63=\"F\",A63,\"\")","v":""}]
[{"$f":"IF(A64=\"F\",A64,\"\")","v":""},null,null,null,null,0,null,null,null,0.45,null,null,null,{"$f":"1-F65-J65","v":0.55000000000000004},null,null,null,{"$f":"IFERROR(E63/100,\"\")","v":0},null,{"$f":"IF(E63=R65*100,\"OK\",\"ERRO\")","v":"OK"}]
[{"$f":"IF(D66>0,\"F\",\"\")","v":""},"VIDROS",null,{"$f":"Orçamento!V369","v":0},{"$f":"Orçamento!X369","v":0},{"$f":"ROUND(F68*$D$66,2)","v":0},null,null,null,{"$f":"ROUND(J68*$D$66,2)","v":0},null,null,null,{"$f":"ROUND(N68*$D$66,2)","v":0},null,null,null,{"$f":"SUM(F66:Q66)","v":0},null,{"$f":"IF(D66=R66,\"OK\",\"ERRO\")","v":"OK"}]
[{"$f":"IF(A66=\"F\",A66,\"\")","v":""}]
[{"$f":"IF(A67=\"F\",A67,\"\")","v":""},null,null,null,null,0,null,null,null,0,null,null,null,{"$f":"1-F68-J68","v":1},null,null,null,{"$f":"IFERROR(E66/100,\"\")","v":0},null,{"$f":"IF(E66=R68*100,\"OK\",\"ERRO\")","v":"OK"}]
[{"$f":"IF(D69>0,\"F\",\"\")","v":""},"REVESTIMENTO DE PAREDE",null,{"$f":"Orçamento!V370","v":0},{"$f":"Orçamento!X370","v":0},{"$f":"ROUND(F71*$D$69,2)","v":0},null,null,null,{"$f":"ROUND(J71*$D$69,2)","v":0},null,null,null,{"$f":"ROUND(N71*$D$69,2)","v":0},null,null,null,{"$f":"SUM(F69:Q69)","v":0},null,{"$f":"IF(D69=R69,\"OK\",\"ERRO\")","v":"OK"}]
[{"$f":"IF(A69=\"F\",A69,\"\")","v":""}]
[{"$f":"IF(A70=\"F\",A70,\"\")","v":""},null,null,null,null,0,null,null,null,0.4,null,null,null,{"$f":"1-F71-J71","v":0.6},null,null,null,{"$f":"IFERROR(E69/100,\"\")","v":0},null,{"$f":"IF(E69=R71*100,\"OK\",\"ERRO\")","v":"OK"}]
[{"$f":"IF(D72>0,\"F\",\"\")","v":""},"FORROS",null,{"$f":"Orçamento!V371","v":0},{"$f":"Orçamento!X371","v":0},{"$f":"ROUND(F74*$D$72,2)","v":0},null,null,null,{"$f":"ROUND(J74*$D$72,2)","v":0},null,null,null,{"$f":"ROUND(N74*$D$72,2)","v":0},null,null,null,{"$f":"SUM(F72:Q72)","v":0},null,{"$f":"IF(D72=R72,\"OK\",\"ERRO\")","v":"OK"}]
[{"$f":"IF(A72=\"F\",A72,\"\")","v":""}]
[{"$f":"IF(A73=\"F\",A73,\"\")","v":""},null,null,null,null,0,null,null,null,0.4,null,null,null,{"$f":"1-F74-J74","v":0.6},null,null,null,{"$f":"IFERROR(E72/100,\"\")","v":0},null,{"$f":"IF(E72=R74*100,\"OK\",\"ERRO\")","v":"OK"}]
[{"$f":"IF(D75>0,\"F\",\"\")","v":""},"REVESTIMENTO DE PISO",null,{"$f":"Orçamento!V372","v":0},{"$f":"Orçamento!X372","v":0},{"$f":"ROUND(F77*$D$75,2)","v":0},null,null,null,{"$f":"ROUND(J77*$D$75,2)","v":0},null,null,null,{"$f":"ROUND(N77*$D$75,2)","v":0},null,null,null,{"$f":"SUM(F75:Q75)","v":0},null,{"$f":"IF(D75=R75,\"OK\",\"ERRO\")","v":"OK"}]
[{"$f":"IF(A75=\"F\",A75,\"\")","v":""}]
[{"$f":"IF(A76=\"F\",A76,\"\")","v":""},null,null,null,null,0,null,null,null,0.4,null,null,null,{"$f":"1-F77-J77","v":0.6},null,null,null,{"$f":"IFERROR(E75/100,\"\")","v":0},null,{"$f":"IF(E75=R77*100,\"OK\",\"ERRO\")","v":"OK"}]
[{"$f":"IF(D78>0,\"F\",\"\")","v":""},"FERRAGENS",null,{"$f":"Orçamento!V373","v":0},{"$f":"Orçamento!X373","v":0},{"$f":"ROUND(F80*$D$78,2)","v":0},null,null,null,{"$f":"ROUND(J80*$D$78,2)","v":0},null,null,null,{"$f":"ROUND(N80*$D$78,2)","v":0},null,null,null,{"$f":"SUM(F78:Q78)","v":0},null,{"$f":"IF(D78=R78,\"OK\",\"ERRO\")","v":"OK"}]
[{"$f":"IF(A78=\"F\",A78,\"\")","v":""}]
[{"$f":"IF(A79=\"F\",A79,\"\")","v":""},null,null,null,null,0,null,null,null,0,null,null,null,{"$f":"1-F80-J80","v":1},null,null,null,{"$f":"IFERROR(E78/100,\"\")","v":0},null,{"$f":"IF(E78=R80*100,\"OK\",\"ERRO\")","v":"OK"}]
[{"$f":"IF(D81>0,\"F\",\"\")","v":""},"MARCENARIA",null,{"$f":"Orçamento!V374","v":0},{"$f":"Orçamento!X374","v":0},{"$f":"ROUND(F83*$D$81,2)","v":0},null,null,null,{"$f":"ROUND(J83*$D$81,2)","v":0},null,null,null,{"$f":"ROUND(N83*$D$81,2)","v":0},null,null,null,{"$f":"SUM(F81:Q81)","v":0},null,{"$f":"IF(D81=R81,\"OK\",\"ERRO\")","v":"OK"}]
[{"$f":"IF(A81=\"F\",A81,\"\")","v":""}]
[{"$f":"IF(A82=\"F\",A82,\"\")","v":""},null,null,null,null,0,null,null,null,0,null,null,null,{"$f":"1-F83-J83","v":1},null,null,null,{"$f":"IFERROR(E81/100,\"\")","v":0},null,{"$f":"IF(E81=R83*100,\"OK\",\"ERRO\")","v":"OK"}]
[{"$f":"IF(D84>0,\"F\",\"\")","v":""},"ADMINISTRAÇÃO - MENSALISTAS",null,{"$f":"Orçamento!V375","v":0},{"$f":"Orçamento!X375","v":0},{"$f":"ROUND(F86*$D$84,2)","v":0},null,null,null,{"$f":"ROUND(J86*$D$84,2)","v":0},null,null,null,{"$f":"ROUND(N86*$D$84,2)","v":0},null,null,null,{"$f":"SUM(F84:Q84)","v":0},null,{"$f":"IF(D84=R84,\"OK\",\"ERRO\")","v":"OK"}]
[{"$f":"IF(A84=\"F\",A84,\"\")","v":""}]
[{"$f":"IF(A85=\"F\",A85,\"\")","v":""},null,null,null,null,0.34,null,null,null,0.33,null,null,null,0.33,null,null,null,{"$f":"IFERROR(E84/100,\"\")","v":0},null,{"$f":"IF(E84=R86*100,\"OK\",\"ERRO\")","v":"OK"}]
[{"$f":"IF(D87>0,\"F\",\"\")","v":""},"PINTURA",null,{"$f":"Orçamento!V376","v":0},{"$f":"Orçamento!X376","v":0},{"$f":"ROUND(F89*$D$87,2)","v":0},null,null,null,{"$f":"ROUND(J89*$D$87,2)","v":0},null,null,null,{"$f":"ROUND(N89*$D$87,2)","v":0},null,null,null,{"$f":"SUM(F87:Q87)","v":0},null,{"$f":"IF(D87=R87,\"OK\",\"ERRO\")","v":"OK"}]
[{"$f":"IF(A87=\"F\",A87,\"\")","v":""}]
[{"$f":"IF(A88=\"F\",A88,\"\")","v":""},null,null,null,null,0,null,null,null,0,null,null,null,{"$f":"1-F89-J89","v":1},null,null,null,{"$f":"IFERROR(E87/100,\"\")","v":0},null,{"$f":"IF(E87=R89*100,\"OK\",\"ERRO\")","v":"OK"}]
[{"$f":"IF(D90>0,\"F\",\"\")","v":""},"DIVERSOS",null,{"$f":"Orçamento!V377","v":0},{"$f":"Orçamento!X377","v":0},{"$f":"ROUND(F92*$D$90,2)","v":0},null,null,null,{"$f":"ROUND(J92*$D$90,2)","v":0},null,null,null,{"$f":"ROUND(N92*$D$90,2)","v":0},null,null,null,{"$f":"SUM(F90:Q90)","v":0},null,{"$f":"IF(D90=R90,\"OK\",\"ERRO\")","v":"OK"}]
[{"$f":"IF(A90=\"F\",A90,\"\")","v":""}]
[{"$f":"IF(A91=\"F\",A91,\"\")","v":""},null,null,null,null,0,null,null,null,0,null,null,null,{"$f":"1-F92-J92","v":1},null,null,null,{"$f":"IFERROR(E90/100,\"\")","v":0},null,{"$f":"IF(E90=R92*100,\"OK\",\"ERRO\")","v":"OK"}]
["F","CUSTO DO ORÇAMENTO",null,{"$f":"SUM(D15:D92)","v":0},{"$f":"SUM(E15:E92)","v":0},{"$f":"F15+F18+F21+F24+F27+F30+F33+F36+F39+F42+F45+F48+F51+F54+F57+F60+F63+F66+F69+F72+F75+F78+F81+F84+F87+F90","v":0},null,null,null,{"$f":"J15+J18+J21+J24+J27+J30+J33+J36+J39+J42+J45+J48+J51+J54+J57+J60+J63+J66+J69+J72+J75+J78+J81+J84+J87+J90","v":0},null,null,null,{"$f":"N15+N18+N21+N24+N27+N30+N33+N36+N39+N42+N45+N48+N51+N54+N57+N60+N63+N66+N69+N72+N75+N78+N81+N84+N87+N90","v":0},null,null,null,{"$f":"R15+R18+R21+R24+R27+R30+R33+R36+R39+R42+R45+R48+R51+R54+R57+R60+R63+R66+R69+R72+R75+R78+R81+R84+R87+R90","v":0}]
["F","PERCENTUAIS:",null,null,null,{"$f":"IFERROR(F93/D93,\"\")","v":""},null,null,null,{"$f":"IFERROR(J93/D93,\"\")","v":""},null,null,null,{"$f":"IFERROR(N93/D93,\"\")","v":""},null,null,null,{"$f":"SUM(F94:Q94)","v":0}]
["F","TOTAIS ACUMULADOS:",null,null,null,{"$f":"F93","v":0},null,null,null,{"$f":"F95+J93","v":0},null,null,null,{"$f":"J95+N93","v":0}]
["F","PERCENTUAIS  ACUMULADOS:",null,null,null,{"$f":"F94","v":""},null,null,null,{"$f":"J94+F96","v":{"$error":"#VALUE!"}},null,null,null,{"$f":"IFERROR(J96+N94,\"\")","v":""}]
["F"]
["F","OBSERVAÇÕES:"]
["F","Os pagamentos somente poderão ser efetuados mediante medição e atesto pelos técnicos da Secretaria da Educação. "]

{"sheet":"Composição BDI","index":4,"n_rows":45,"n_cols":9,"rows_kept":45,"cut":false,"hidden":false,"merged":[[18,5,18,8],[17,0,17,3],[16,0,16,3],[44,0,44,3],[42,0,42,3],[43,0,43,3],[18,0,18,3],[36,0,36,3],[39,0,39,3],[38,0,38,3],[40,0,40,3],[29,0,29,2],[32,0,32,3],[33,0,33,3],[34,0,34,3],[35,0,35,3],[0,0,0,3],[1,0,1,3],[4,0,4,3],[7,0,7,3],[10,0,10,3],[2,0,2,3],[3,0,3,3],[5,0,5,3],[6,0,6,3],[8,0,8,3],[9,0,9,3],[11,0,11,3],[12,0,12,3],[14,0,14,3],[15,0,15,3],[13,0,13,3]]}
[]
[]
["UNIDADE ESCOLAR"]
[{"$f":"Orçamento!$O$5","v":"COLÉGIO ESTADUAL DA POLÍCIA MILITAR DE GOIÁS DE FORMOSA - DOMINGOS DE OLIVEIRA"}]
[]
["OBRA"]
[{"$f":"Orçamento!$O$8","v":"REFORMA E AMPLIAÇÃO"}]
[]
["ENDEREÇO"]
[{"$f":"Orçamento!$R$11","v":"Avenida Santa Bárbara S/Nº, Loteamento Santa Bárbara, CEP:73803-155"}]
[]
["CIDADE"]
[{"$f":"Orçamento!$V$8","v":"FORMOSA"}]
[]
["CRE"]
[{"$f":"Orçamento!$O$11","v":"FORMOSA"}]
[]
["DETALHAMENTO DA COMPOSIÇÃO DE BDI"]
["COMPOSIÇÃO BDI PARA OBRAS CIVIS",null,null,null,null,"BDI CONSTRUÇÃO E REFORMA"]
["DESCRIÇÃO","COEF.","TAXA % (a.m)","% no preço de venda",null,"Situação","1º Quartil","Médio","3º Quartil"]
["1) COFINS",1,0.03,{"$f":"C21","v":0.03},null,{"$f":"IF(OR(C21<G21,C21>I21),\"FORA DO INTERVALO\",\"OK\")","v":"OK"},0.03,0.03,0.03]
["2) PIS",1,6.4999999999999997E-3,{"$f":"C22","v":6.4999999999999997E-3},null,{"$f":"IF(OR(C22<G22,C22>I22),\"FORA DO INTERVALO\",\"OK\")","v":"OK"},6.4999999999999997E-3,6.4999999999999997E-3,6.4999999999999997E-3]
["3) ISSQN",1,{"$f":"IFERROR(VLOOKUP($A$13,#REF!,10,FALSE())/100,0)","v":0},{"$f":"C23*B23","v":0},null,"FORA DO INTERVALO",0.02,3.5000000000000003E-2,0.05]
["4) CPRB",1,{"$f":"IF(Orçamento!$T$11=\"DESONERADA\",4.5%,0)","v":0},{"$f":"C24","v":0},null,"FORA DO INTERVALO",4.4999999999999998E-2,4.4999999999999998E-2,4.4999999999999998E-2]
["5) Administração Central",1,4.5999999999999999E-2,4.5999999999999999E-2,null,"OK",0.03,0.04,5.5E-2]
["6) Despesas Financeiras",1,5.5999999999999999E-3,5.5999999999999999E-3,null,"FORA DO INTERVALO",5.8999999999999999E-3,1.23E-2,1.3899999999999999E-2]
["7) Seguros + Garantias",1,1.1999999999999999E-3,1.1999999999999999E-3,null,"FORA DO INTERVALO",8.0000000000000002E-3,8.0000000000000002E-3,0.01]
["8) Risco",1,9.7000000000000003E-3,9.7000000000000003E-3,null,"OK",9.7000000000000003E-3,1.2699999999999999E-2,1.2699999999999999E-2]
["9) Lucro",1,7.3999999999999996E-2,7.3999999999999996E-2,null,"OK",6.1600000000000002E-2,7.3999999999999996E-2,8.9599999999999999E-2]
["BDI - FINAL",null,null,0.20344461714285722,null,{"$f":"IF(OR(D30<G30,D30>I30),\"FORA DO INTERVALO\",\"OK\")","v":"OK"},0.2034,0.22120000000000001,0.25]
[]
["Notas:"]
["(1) e (2) Alíquota definida por lei."]
["(3) Alíquota e base de cálculo definidas pela legislação municipal."]
["(4) Alíquota definida pelas leis 12.546/11, 12844/13 e 13.161/15 (CPRB – contribuição previdenciária sobre a receita bruta)."]
["(5) Valores definidos a partir dos limites no Acórdão nº 2.622/2013 - TCU – Plenário. Valores entre o 1º e 3º quartis."]
["(6) Valor calculado pela expressão matemática do acórdão 2.369/2011 – TCU – Plenário e disponibilizado pela AGETOP em dezembro de 2018. (Foi utilizado para o cálculo a média da Taxa SELIC no período de 11/2017 a 10/2018)"]
[]
["(7) Valores definidos pela AGETOP a partir dos limites no Acórdão nº 2.622/2013 - TCU – Plenário. Valores médios. \n\nObservação da AGETOP: (Seguros contra erros de execução, incêndio e explosão, danos da natureza (vendaval, destelhamento, alagamento, inundação, desmoronamento, geadas etc.), emprego de material defeituoso ou inadequado, roubo e/ou furto qualificado, quebra de equipamentos, desmoronamento de estrutura, nas modalidades de Obras Civis em Construção (OCC); Instalação e Montagem (IM); e Obras Civis em Construção e Instalação e Montagem (OCC/IM). Bem como coberturas adicionais para ampliação dessas coberturas básicas, como: cobertura de responsabilidade civil geral, cobertura de responsabilidade civil cruzada, cobertura de despesas extraordinárias, cobertura de tumultos, cobertura de desentulho do local, cobertura de riscos do fabricante, dentre outras, incluindo o seguro de vida em grupo regido pela convenção coletiva dos trabalhadores na indústria da construção civil). A partir de 24/02/2015 por intermédio da Portaria 449/2015 a Presidência da AGETOP, na pessoa do Senhor Jayme Eduardo Rincon, determinou a exclusão dos valores referentes aos Seguros de Risco de Engenharia e Responsabilidade Civil do Profissional na composição do cálculo do B.D.I.."]
["(8) Valores definidos a partir dos limites no Acórdão nº 2.622/2013 - TCU – Plenário. Valores entre 1º e 3° quartis."]
["(9) Valores definidos a partir dos limites definidos no Acórdão nº 2.622/2013 - TCU – Plenário. Valores adotados e praticados no mercado ( “ ex ante ” ) ou aqueles entre os 1º e 3º quartis."]
[]
["(*) A fórmula para estipulação da taxa de BDI estimado adotado é a mesma que foi aplicada para a obtenção das tabelas contidas no Acórdão n. 2.622/2013 – TCUPlenário"]
[]
["Obs.: Para obras com valores superiores a R$ 20.000.000,00 sugere-se recalcular o BDI, dimensionando as taxas de administração central e lucro para patamares inferiores ao estipulado acima."]

{"sheet":"Relatório CENTRAL","index":5,"n_rows":40,"n_cols":5,"rows_kept":40,"cut":false,"hidden":false,"merged":[[8,1,8,2],[8,3,8,4],[9,1,9,2],[10,1,10,4],[11,1,11,4],[39,1,39,2],[9,0,11,0],[0,1,0,4],[6,3,6,4],[9,3,9,4],[1,1,1,4],[2,1,2,2],[2,3,2,4],[3,1,3,2],[3,3,3,4],[4,1,4,4],[5,1,5,2],[5,3,5,4],[6,1,6,2],[7,1,7,4]]}
[]
[]
[null,"UNIDADE ESCOLAR",null,"CIDADE"]
[null,{"$f":"Orçamento!$O$5","v":"COLÉGIO ESTADUAL DA POLÍCIA MILITAR DE GOIÁS DE FORMOSA - DOMINGOS DE OLIVEIRA"},null,{"$f":"Orçamento!$V$8","v":"FORMOSA"}]
[]
[null,"OBRA",null,"CRE"]
[null,{"$f":"Orçamento!$O$8","v":"REFORMA E AMPLIAÇÃO"},null,{"$f":"Orçamento!$O$11","v":"FORMOSA"}]
[]
[null,"ENDEREÇO",null,"DATA"]
["FILTRO",{"$f":"Orçamento!$R$11","v":"Avenida Santa Bárbara S/Nº, Loteamento Santa Bárbara, CEP:73803-155"},null,{"$f":"Orçamento!$S$8","v":"2020-04-02"}]
[]
[null,"RELATÓRIO CENTRAL"]
["↓","CÓDIGO","ETAPA","PREÇO  (R$) C/ BDI","PARTIC  ( % )"]
[{"$f":"IF(D14>0,\"F\",\"\")","v":""},{"$f":"Orçamento!O352","v":"a."},{"$f":"Orçamento!P352","v":"SERVIÇOS PRELIMINARES"},{"$f":"Orçamento!V352","v":0},{"$f":"Orçamento!X352","v":0}]
[{"$f":"IF(D15>0,\"F\",\"\")","v":""},{"$f":"Orçamento!O353","v":"b."},{"$f":"Orçamento!P353","v":"TRANSPORTES"},{"$f":"Orçamento!V353","v":0},{"$f":"Orçamento!X353","v":0}]
["",{"$f":"Orçamento!O354","v":"c."},{"$f":"Orçamento!P354","v":"SERVIÇO EM TERRA"},{"$f":"Orçamento!V354","v":0},{"$f":"Orçamento!X354","v":0}]
["",{"$f":"Orçamento!O355","v":"d."},{"$f":"Orçamento!P355","v":"FUNDAÇÕES E SONDAGENS"},{"$f":"Orçamento!V355","v":0},{"$f":"Orçamento!X355","v":0}]
["",{"$f":"Orçamento!O356","v":"e."},{"$f":"Orçamento!P356","v":"ESTRUTURA"},{"$f":"Orçamento!V356","v":0},{"$f":"Orçamento!X356","v":0}]
["",{"$f":"Orçamento!O357","v":"f."},{"$f":"Orçamento!P357","v":"INSTALAÇÕES ELÉTRICAS"},{"$f":"Orçamento!V357","v":0},{"$f":"Orçamento!X357","v":0}]
["",{"$f":"Orçamento!O358","v":"g."},{"$f":"Orçamento!P358","v":"INSTALAÇÕES HIDROSSANITÁRIAS"},{"$f":"Orçamento!V358","v":0},{"$f":"Orçamento!X358","v":0}]
["",{"$f":"Orçamento!O359","v":"h"},{"$f":"Orçamento!P359","v":"INSTALAÇÕES ESPECIAIS"},{"$f":"Orçamento!V359","v":0},{"$f":"Orçamento!X359","v":0}]
["",{"$f":"Orçamento!O360","v":"i."},{"$f":"Orçamento!P360","v":"ALVENARIAS E DIVISÓRIAS"},{"$f":"Orçamento!V360","v":0},{"$f":"Orçamento!X360","v":0}]
["",{"$f":"Orçamento!O361","v":"j."},{"$f":"Orçamento!P361","v":"ALVENARIA AUTO-PORTANTE"},{"$f":"Orçamento!V361","v":0},{"$f":"Orçamento!X361","v":0}]
["",{"$f":"Orçamento!O362","v":"k."},{"$f":"Orçamento!P362","v":"IMPERMEABILIZAÇÃO"},{"$f":"Orçamento!V362","v":0},{"$f":"Orçamento!X362","v":0}]
["",{"$f":"Orçamento!O363","v":"l."},{"$f":"Orçamento!P363","v":"ISOLAMENTO TÉRMICO E ACÚSTICO"},{"$f":"Orçamento!V363","v":0},{"$f":"Orçamento!X363","v":0}]
["",{"$f":"Orçamento!O364","v":"m."},{"$f":"Orçamento!P364","v":"ESTRUTURA DE MADEIRA"},{"$f":"Orçamento!V364","v":0},{"$f":"Orçamento!X364","v":0}]
["",{"$f":"Orçamento!O365","v":"n."},{"$f":"Orçamento!P365","v":"ESTRUTURAS METÁLICAS"},{"$f":"Orçamento!V365","v":0},{"$f":"Orçamento!X365","v":0}]
["",{"$f":"Orçamento!O366","v":"o."},{"$f":"Orçamento!P366","v":"COBERTURAS"},{"$f":"Orçamento!V366","v":0},{"$f":"Orçamento!X366","v":0}]
["",{"$f":"Orçamento!O367","v":"p."},{"$f":"Orçamento!P367","v":"ESQUADRIAS DE MADEIRA"},{"$f":"Orçamento!V367","v":0},{"$f":"Orçamento!X367","v":0}]
["",{"$f":"Orçamento!O368","v":"q."},{"$f":"Orçamento!P368","v":"ESQUADRIAS METÁLICAS"},{"$f":"Orçamento!V368","v":0},{"$f":"Orçamento!X368","v":0}]
["",{"$f":"Orçamento!O369","v":"r."},{"$f":"Orçamento!P369","v":"VIDROS"},{"$f":"Orçamento!V369","v":0},{"$f":"Orçamento!X369","v":0}]
["",{"$f":"Orçamento!O370","v":"s."},{"$f":"Orçamento!P370","v":"REVESTIMENTO DE PAREDE"},{"$f":"Orçamento!V370","v":0},{"$f":"Orçamento!X370","v":0}]
["",{"$f":"Orçamento!O371","v":"t."},{"$f":"Orçamento!P371","v":"FORROS"},{"$f":"Orçamento!V371","v":0},{"$f":"Orçamento!X371","v":0}]
["",{"$f":"Orçamento!O372","v":"u."},{"$f":"Orçamento!P372","v":"REVESTIMENTO DE PISO"},{"$f":"Orçamento!V372","v":0},{"$f":"Orçamento!X372","v":0}]
["",{"$f":"Orçamento!O373","v":"v."},{"$f":"Orçamento!P373","v":"FERRAGENS"},{"$f":"Orçamento!V373","v":0},{"$f":"Orçamento!X373","v":0}]
["",{"$f":"Orçamento!O374","v":"w."},{"$f":"Orçamento!P374","v":"MARCENARIA"},{"$f":"Orçamento!V374","v":0},{"$f":"Orçamento!X374","v":0}]
["",{"$f":"Orçamento!O375","v":"x."},{"$f":"Orçamento!P375","v":"ADMINISTRAÇÃO"},{"$f":"Orçamento!V375","v":0},{"$f":"Orçamento!X375","v":0}]
["",{"$f":"Orçamento!O376","v":"y."},{"$f":"Orçamento!P376","v":"PINTURA"},{"$f":"Orçamento!V376","v":0},{"$f":"Orçamento!X376","v":0}]
["",{"$f":"Orçamento!O377","v":"z."},{"$f":"Orçamento!P377","v":"DIVERSOS"},{"$f":"Orçamento!V377","v":0},{"$f":"Orçamento!X377","v":0}]
["F","TOTAL GERAL DO ORÇAMENTO (R$) C/BDI",null,{"$f":"SUM(D14:D39)","v":0},{"$f":"SUM(E14:E39)","v":0}]

{"sheet":"Parc Maior Relev","index":6,"n_rows":35,"n_cols":7,"rows_kept":35,"cut":false,"hidden":false,"merged":[[35,3,35,7],[33,1,33,6],[0,1,0,6],[11,1,11,6],[1,1,1,6],[2,1,2,3],[2,4,2,6],[3,1,3,3],[3,4,3,6],[4,1,4,6],[5,1,5,3],[5,4,5,6],[9,1,9,3],[9,4,9,6],[10,1,10,6],[6,1,6,3],[6,4,6,6],[7,1,7,6],[8,1,8,3],[8,4,8,6]]}
[]
[]
[null,"UNIDADE ESCOLAR",null,null,"CÓDIGO INEP"]
[null,{"$f":"Orçamento!$O$5","v":"COLÉGIO ESTADUAL DA POLÍCIA MILITAR DE GOIÁS DE FORMOSA - DOMINGOS DE OLIVEIRA"},null,null,{"$f":"Orçamento!$V$5","v":52046273}]
[]
[null,"OBRA",null,null,"CIDADE"]
[null,{"$f":"Orçamento!$O$8","v":"REFORMA E AMPLIAÇÃO"},null,null,{"$f":"Orçamento!$V$8","v":"FORMOSA"}]
[]
[null,"CRE",null,null,"ÁREA TOTAL CONSTRUÍDA (M²)"]
[null,{"$f":"Orçamento!$O$11","v":"FORMOSA"},null,null,{"$f":"Orçamento!$V$14","v":2646.3}]
[]
["FILTRO","PARCELA DE MAIOR RELEVÂNCIA"]
[{"$f":"IF(G14>0,\"F\",\"\")","v":""},"CÓDIGO","SERVIÇO","DESCRIÇÃO","UNID","QUANT","PARC. MAIOR RELEV (100%)"]
[{"$f":"IF(G14>0,\"F\",\"\")","v":""},{"$f":"Somatório!B22","v":"f."},"INSTALAÇÕES ELÉTRICAS","SUBESTAÇÃO","KVA",{"$f":"SUMIF(Orçamento!$R$21:$R$333,'Parc Maior Relev'!D14,Orçamento!$T$21:$T$333)","v":0},{"$f":"F14","v":0}]
[{"$f":"IF(SUM(G16:G32)>0,\"F\",\"\")","v":"F"},"CÓDIGO","SERVIÇO","DESCRIÇÃO","UNID","QUANT","PARC. MAIOR RELEV (50%)"]
[{"$f":"IF(G16>0,\"F\",\"\")","v":""},{"$f":"Somatório!B21","v":"e."},"ESTRUTURA","CONCRETO","M3",{"$f":"SUMIF(Orçamento!$R$21:$R$333,'Parc Maior Relev'!D16,Orçamento!$T$21:$T$333)","v":0},{"$f":"F16*0.5","v":0}]
[{"$f":"IF(G17>0,\"F\",\"\")","v":""},"f.","INSTALAÇÕES ELÉTRICAS","INSTALAÇÕES ELÉTRICAS","KVA",{"$f":"SUMIF(Orçamento!$R$21:$R$333,'Parc Maior Relev'!D17,Orçamento!$T$21:$T$333)","v":0},{"$f":"F17","v":0}]
[{"$f":"IF(G18>0,\"F\",\"\")","v":""},{"$f":"Somatório!B25","v":"i."},"ALVENARIA E DIVISÓRIAS","ALVENARIA DE TIJOLOS","M2",{"$f":"SUMIF(Orçamento!$R$21:$R$333,'Parc Maior Relev'!D18,Orçamento!$T$21:$T$333)","v":0},{"$f":"F18*0.5","v":0}]
["",{"$f":"Somatório!B29","v":"m."},"ESTRUTURA DE MADEIRA","ESTRUTURA DE MADEIRA","M2",{"$f":"SUMIF(Orçamento!$R$21:$R$333,'Parc Maior Relev'!D19,Orçamento!$T$21:$T$333)","v":0},0]
["F",{"$f":"Somatório!B31","v":"o."},"COBERTURAS","COBERTURA CERÂMICA","M2",{"$f":"Orçamento!T298","v":88.69},44.344999999999999]
["","o.","COBERTURAS","COBERTURA COM TELHA METÁLICA","M2",{"$f":"SUMIF(Orçamento!$R$21:$R$333,'Parc Maior Relev'!D21,Orçamento!$T$21:$T$333)","v":0},0]
["",{"$f":"Somatório!B35","v":"s."},"REVESTIMENTO DE PAREDE","CHAPISCO","M2",{"$f":"SUMIF(Orçamento!$R$21:$R$333,'Parc Maior Relev'!D22,Orçamento!$T$21:$T$333)","v":0},0]
["","s.","REVESTIMENTO DE PAREDE","REBOCO","M2",{"$f":"SUMIF(Orçamento!$R$21:$R$333,'Parc Maior Relev'!D23,Orçamento!$T$21:$T$333)","v":0},{"$f":"F23*0.5","v":0}]
["","s.","REVESTIMENTO DE PAREDE","REVESTIMENTO CERÂMICO","M2",{"$f":"SUMIF(Orçamento!$R$21:$R$333,'Parc Maior Relev'!D24,Orçamento!$T$21:$T$333)","v":0},{"$f":"F24*0.5","v":0}]
["",{"$f":"Somatório!B36","v":"t."},"FORROS","FORRO DE GESSO","M2",{"$f":"SUMIF(Orçamento!$R$21:$R$333,'Parc Maior Relev'!D25,Orçamento!$T$21:$T$333)","v":0},{"$f":"F25*0.5","v":0}]
["","t.","FORROS","FORRO DE PVC","M2",{"$f":"SUMIF(Orçamento!$R$21:$R$333,'Parc Maior Relev'!D26,Orçamento!$T$21:$T$333)","v":0},{"$f":"F26*0.5","v":0}]
["","t.","FORROS","FORRO DE GESSO ACARTONADO","M2",{"$f":"SUMIF(Orçamento!$R$21:$R$333,'Parc Maior Relev'!D27,Orçamento!$T$21:$T$333)","v":0},{"$f":"F27*0.5","v":0}]
["F","u.","REVESTIMENTO DE PISO","PISO DE GRANITINA","M2",{"$f":"Orçamento!T168+Orçamento!T317","v":67.150000000000006},33.575000000000003]
["","u.","REVESTIMENTO DE PISO","PISO LAMINADO","M2",{"$f":"SUMIF(Orçamento!$R$21:$R$333,'Parc Maior Relev'!D29,Orçamento!$T$21:$T$333)","v":0},0]
["","u.","REVESTIMENTO DE PISO","PISO DE CONCRETO DESEMPENADO","M2",{"$f":"SUMIF(Orçamento!$R$21:$R$333,'Parc Maior Relev'!D30,Orçamento!$T$21:$T$333)","v":0},0]
["","u.","REVESTIMENTO DE PISO","PISO CERÂMICO","M2",{"$f":"SUMIF(Orçamento!$R$21:$R$333,'Parc Maior Relev'!D31,Orçamento!$T$21:$T$333)","v":0},{"$f":"F31*0.5","v":0}]
["","y.","PINTURA","PINTURA","M2",{"$f":"SUMIF(Orçamento!$R$21:$R$333,'Parc Maior Relev'!D32,Orçamento!$T$21:$T$333)","v":0},0]
["F"]
["F","(*) Para os fins do inciso I dp § 1º do Art. 30 da Lei Federal 8.666/93, são consideradas parcelas de maior relevância técnica as execuções apresentadas"]
["F"]

{"sheet":"Composições","index":7,"n_rows":428,"n_cols":10,"rows_kept":428,"cut":false,"hidden":false,"merged":[[0,0,0,8],[10,0,10,2],[10,3,10,6],[11,0,11,9],[12,0,12,2],[12,3,12,6],[12,7,12,8],[7,0,7,6],[9,0,9,2],[9,3,9,6],[9,7,9,8],[3,0,3,6],[4,0,4,6],[15,0,15,9],[13,0,13,2],[13,3,13,6],[1,0,1,9],[3,7,3,9],[4,7,4,9],[6,7,6,9],[7,7,7,9],[6,0,6,6],[10,8,10,9],[13,8,13,9],[14,0,14,9],[8,0,8,9],[5,0,5,9],[2,0,2,9],[16,5,17,5],[16,6,16,7],[16,8,16,9],[21,1,21,7],[23,1,23,7],[16,0,17,0],[16,1,17,1],[16,2,17,2],[16,3,17,3],[16,4,17,4],[25,5,26,5],[25,6,25,7],[25,8,25,9],[30,1,30,7],[32,1,32,7],[25,0,26,0],[25,1,26,1],[25,2,26,2],[25,3,26,3],[25,4,26,4],[34,5,35,5],[34,6,34,7],[34,8,34,9],[39,1,39,7],[41,1,41,7],[34,0,35,0],[34,1,35,1],[34,2,35,2],[34,3,35,3],[34,4,35,4],[43,5,44,5],[43,6,43,7],[43,8,43,9],[48,1,48,7],[51,1,51,7],[43,0,44,0],[43,1,44,1],[43,2,44,2],[43,3,44,3],[43,4,44,4],[53,5,54,5],[53,6,53,7],[53,8,53,9],[58,1,58,7],[61,1,61,7],[53,0,54,0],[53,1,54,1],[53,2,54,2],[53,3,54,3],[53,4,54,4],[63,5,64,5],[63,6,63,7],[63,8,63,9],[68,1,68,7],[71,1,71,7],[63,0,64,0],[63,1,64,1],[63,2,64,2],[63,3,64,3],[63,4,64,4],[73,5,74,5],[73,6,73,7],[73,8,73,9],[78,1,78,7],[80,1,80,7],[73,0,74,0],[73,1,74,1],[73,2,74,2],[73,3,74,3],[73,4,74,4],[82,5,83,5],[82,6,82,7],[82,8,82,9],[87,1,87,7],[89,1,89,7],[82,0,83,0],[82,1,83,1],[82,2,83,2],[82,3,83,3],[82,4,83,4],[91,5,92,5],[91,6,91,7],[91,8,91,9],[96,1,96,7],[98,1,98,7],[91,0,92,0],[91,1,92,1],[91,2,92,2],[91,3,92,3],[91,4,92,4],[100,5,101,5],[100,6,100,7],[100,8,100,9],[105,1,105,7],[108,1,108,7],[100,0,101,0],[100,1,101,1],[100,2,101,2],[100,3,101,3],[100,4,101,4],[110,5,111,5],[110,6,110,7],[110,8,110,9],[114,1,114,7],[118,1,118,7],[110,0,111,0],[110,1,111,1],[110,2,111,2],[110,3,111,3],[110,4,111,4],[120,5,121,5],[120,6,120,7],[120,8,120,9],[124,1,124,7],[128,1,128,7],[120,0,121,0],[120,1,121,1],[120,2,121,2],[120,3,121,3],[120,4,121,4],[130,5,131,5],[130,6,130,7],[130,8,130,9],[134,1,134,7],[135,1,135,7],[130,0,131,0],[130,1,131,1],[130,2,131,2],[130,3,131,3],[130,4,131,4],[137,5,138,5],[137,6,137,7],[137,8,137,9],[141,1,141,7],[148,1,148,7],[137,0,138,0],[137,1,138,1],[137,2,138,2],[137,3,138,3],[137,4,138,4],[150,5,151,5],[150,6,150,7],[150,8,150,9],[155,1,155,7],[157,1,157,7],[150,0,151,0],[150,1,151,1],[150,2,151,2],[150,3,151,3],[150,4,151,4],[159,5,160,5],[159,6,159,7],[159,8,159,9],[163,1,163,7],[165,1,165,7],[159,0,160,0],[159,1,160,1],[159,2,160,2],[159,3,160,3],[159,4,160,4],[167,5,168,5],[167,6,167,7],[167,8,167,9],[172,1,172,7],[174,1,174,7],[167,0,168,0],[167,1,168,1],[167,2,168,2],[167,3,168,3],[167,4,168,4],[176,5,177,5],[176,6,176,7],[176,8,176,9],[180,1,180,7],[182,1,182,7],[176,0,177,0],[176,1,177,1],[176,2,177,2],[176,3,177,3],[176,4,177,4],[184,5,185,5],[184,6,184,7],[184,8,184,9],[189,1,189,7],[192,1,192,7],[184,0,185,0],[184,1,185,1],[184,2,185,2],[184,3,185,3],[184,4,185,4],[194,5,195,5],[194,6,194,7],[194,8,194,9],[199,1,199,7],[202,1,202,7],[194,0,195,0],[194,1,195,1],[194,2,195,2],[194,3,195,3],[194,4,195,4],[204,5,205,5],[204,6,204,7],[204,8,204,9],[209,1,209,7],[212,1,212,7],[204,0,205,0],[204,1,205,1],[204,2,205,2],[204,3,205,3],[204,4,205,4],[214,5,215,5],[214,6,214,7],[214,8,214,9],[219,1,219,7],[222,1,222,7],[214,0,215,0],[214,1,215,1],[214,2,215,2],[214,3,215,3],[214,4,215,4],[224,5,225,5],[224,6,224,7],[224,8,224,9],[228,1,228,7],[230,1,230,7],[224,0,225,0],[224,1,225,1],[224,2,225,2],[224,3,225,3],[224,4,225,4],[232,5,233,5],[232,6,232,7],[232,8,232,9],[237,1,237,7],[239,1,239,7],[232,0,233,0],[232,1,233,1],[232,2,233,2],[232,3,233,3],[232,4,233,4],[241,5,242,5],[241,6,241,7],[241,8,241,9],[246,1,246,7],[248,1,248,7],[241,0,242,0],[241,1,242,1],[241,2,242,2],[241,3,242,3],[241,4,242,4],[250,5,251,5],[250,6,250,7],[250,8,250,9],[255,1,255,7],[257,1,257,7],[250,0,251,0],[250,1,251,1],[250,2,251,2],[250,3,251,3],[250,4,251,4],[259,5,260,5],[259,6,259,7],[259,8,259,9],[264,1,264,7],[266,1,266,7],[259,0,260,0],[259,1,260,1],[259,2,260,2],[259,3,260,3],[259,4,260,4],[268,5,269,5],[268,6,268,7],[268,8,268,9],[272,1,272,7],[276,1,276,7],[268,0,269,0],[268,1,269,1],[268,2,269,2],[268,3,269,3],[268,4,269,4],[278,5,279,5],[278,6,278,7],[278,8,278,9],[282,1,282,7],[286,1,286,7],[278,0,279,0],[278,1,279,1],[278,2,279,2],[278,3,279,3],[278,4,279,4],[288,5,289,5],[288,6,288,7],[288,8,288,9],[292,1,292,7],[299,1,299,7],[288,0,289,0],[288,1,289,1],[288,2,289,2],[288,3,289,3],[288,4,289,4],[301,5,302,5],[301,6,301,7],[301,8,301,9],[305,1,305,7],[309,1,309,7],[301,0,302,0],[301,1,302,1],[301,2,302,2],[301,3,302,3],[301,4,302,4],[311,5,312,5],[311,6,311,7],[311,8,311,9],[315,1,315,7],[319,1,319,7],[311,0,312,0],[311,1,312,1],[311,2,312,2],[311,3,312,3],[311,4,312,4],[321,5,322,5],[321,6,321,7],[321,8,321,9],[325,1,325,7],[329,1,329,7],[321,0,322,0],[321,1,322,1],[321,2,322,2],[321,3,322,3],[321,4,322,4],[331,5,332,5],[331,6,331,7],[331,8,331,9],[335,1,335,7],[339,1,339,7],[331,0,332,0],[331,1,332,1],[331,2,332,2],[331,3,332,3],[331,4,332,4],[341,5,342,5],[341,6,341,7],[341,8,341,9],[346,1,346,7],[348,1,348,7],[341,0,342,0],[341,1,342,1],[341,2,342,2],[341,3,342,3],[341,4,342,4],[350,5,351,5],[350,6,350,7],[350,8,350,9],[355,1,355,7],[357,1,357,7],[350,0,351,0],[350,1,351,1],[350,2,351,2],[350,3,351,3],[350,4,351,4],[359,5,360,5],[359,6,359,7],[359,8,359,9],[364,1,364,7],[366,1,366,7],[359,0,360,0],[359,1,360,1],[359,2,360,2],[359,3,360,3],[359,4,360,4],[368,5,369,5],[368,6,368,7],[368,8,368,9],[373,1,373,7],[375,1,375,7],[368,0,369,0],[368,1,369,1],[368,2,369,2],[368,3,369,3],[368,4,369,4],[377,5,378,5],[377,6,377,7],[377,8,377,9],[382,1,382,7],[384,1,384,7],[377,0,378,0],[377,1,378,1],[377,2,378,2],[377,3,378,3],[377,4,378,4],[386,5,387,5],[386,6,386,7],[386,8,386,9],[390,1,390,7],[394,1,394,7],[386,0,387,0],[386,1,387,1],[386,2,387,2],[386,3,387,3],[386,4,387,4],[396,5,397,5],[396,6,396,7],[396,8,396,9],[400,1,400,7],[404,1,404,7],[396,0,397,0],[396,1,397,1],[396,2,397,2],[396,3,397,3],[396,4,397,4],[406,5,407,5],[406,6,406,7],[406,8,406,9],[410,1,410,7],[417,1,417,7],[406,0,407,0],[406,1,407,1],[406,2,407,2],[406,3,407,3],[406,4,407,4],[419,5,420,5],[419,6,419,7],[419,8,419,9],[423,1,423,7],[427,1,427,7],[419,0,420,0],[419,1,420,1],[419,2,420,2],[419,3,420,3],[419,4,420,4]]}
[]
[]
[]
["UNIDADE ESCOLAR",null,null,null,null,null,null,"CÓDIGO INEP"]
[{"$f":"Orçamento!$O$5","v":"COLÉGIO ESTADUAL DA POLÍCIA MILITAR DE GOIÁS DE FORMOSA - DOMINGOS DE OLIVEIRA"},null,null,null,null,null,null,{"$f":"Orçamento!$V$5","v":52046273}]
[]
["OBRA",null,null,null,null,null,null,"CIDADE"]
[{"$f":"Orçamento!$O$8","v":"REFORMA E AMPLIAÇÃO"},null,null,null,null,null,null,{"$f":"Orçamento!$V$8","v":"FORMOSA"}]
[]
["CRE",null,null,"ENDEREÇO",null,null,null,"REFERÊNCIA AGETOP"]
[{"$f":"Orçamento!$O$11","v":"FORMOSA"},null,null,{"$f":"Orçamento!$R$11","v":"Avenida Santa Bárbara S/Nº, Loteamento Santa Bárbara, CEP:73803-155"},null,null,null,{"$f":"Orçamento!$S$11","v":"ABR/19"},{"$f":"Orçamento!$T$11","v":"ONERADA"}]
[]
["DATA",null,null,"ÁREA TOTAL CONSTRUÍDA (M²)",null,null,null,"REFERÊNCIA SINAPI"]
[{"$f":"Orçamento!$S$8","v":"2020-04-02"},null,null,{"$f":"Orçamento!$V$14","v":2646.3},null,null,null,{"$f":"Orçamento!$V$11","v":"DEZ/19"},{"$f":"Orçamento!$W$11","v":"ONERADA"}]
[]
["COMPOSIÇÕES DE CUSTOS UNITÁRIOS - SEE-GO"]
[34,"FONTE","CÓDIGO","DESCRIÇÃO","UNIDADE","COEFIC.","CUSTO UNITÁRIO",null,"CUSTO  TOTAL (A) + (B) + (C) + (D) + (E)"]
[null,null,null,null,null,null,"DESONERADO","NÃO DESONER.","DESONERADO","NÃO DESONER."]
[null,"COMPOSIÇÃO","COMP 034_SEE","TERMINAL AÉREO SPDA 30CM Fo Go DIAM. 5/16\" COM SUPORTE","UN ",null,null,null,16.259999999999998,17.329999999999998]
[null,"AGETOP_I",8,"AJUDANTE","h     ",0.3,8.75,10.14,2.63,3.04]
[null,"AGETOP_I",12,"ELETRICISTA","h     ",0.3,13.95,16.16,4.1900000000000004,4.8499999999999996]
[null,"MÃO DE OBRA (B) - TOTAL",null,null,null,null,null,null,6.82,7.89]
[null,"SINAPI_I",7571,"TERMINAL AEREO EM ACO GALVANIZADO DN 5/16\", COMPRIMENTO DE 350MM, COM BASE DE FIXACAO HORIZONTAL","UN    ",1,9.44,9.44,9.44,9.44]
[null,"MATERIAL (C) - TOTAL",null,null,null,null,null,null,9.44,9.44]
[]
[35,"FONTE","CÓDIGO","DESCRIÇÃO","UNIDADE","COEFIC.","CUSTO UNITÁRIO",null,"CUSTO  TOTAL (A) + (B) + (C) + (D) + (E)"]
[null,null,null,null,null,null,"DESONERADO","NÃO DESONER.","DESONERADO","NÃO DESONER."]
[null,"COMPOSIÇÃO","COMP 035_SEE","CLIPS 3/8 P/ CABO DE AÇO BELGO","UN ",null,null,null,1.99,2.29]
[null,"AGETOP_I",8,"AJUDANTE","h     ",8.3299999999999999E-2,8.75,10.14,0.73,0.84]
[null,"AGETOP_I",12,"ELETRICISTA","h     ",8.3299999999999999E-2,13.95,16.16,1.1599999999999999,1.35]
[null,"MÃO DE OBRA (B) - TOTAL",null,null,null,null,null,null,1.89,2.19]
[null,"COTAÇÃO","COT 003_SEE","CLIPS 3/8 P/ CABO DE AÇO BELGO","UN ",1,0.10333333333333333,0.10333333333333333,0.1,0.1]
[null,"MATERIAL (C) - TOTAL",null,null,null,null,null,null,0.1,0.1]
[]
[36,"FONTE","CÓDIGO","DESCRIÇÃO","UNIDADE","COEFIC.","CUSTO UNITÁRIO",null,"CUSTO  TOTAL (A) + (B) + (C) + (D) + (E)"]
[null,null,null,null,null,null,"DESONERADO","NÃO DESONER.","DESONERADO","NÃO DESONER."]
[null,"COMPOSIÇÃO","COMP 036_SEE","PRESILHA LATÃO 16/35MM 5MM+PARAF FENDA ","UN ",null,null,null,3.48,3.7800000000000002]
[null,"AGETOP_I",8,"AJUDANTE","h     ",8.3299999999999999E-2,8.75,10.14,0.73,0.84]
[null,"AGETOP_I",12,"ELETRICISTA","h     ",8.3299999999999999E-2,13.95,16.16,1.1599999999999999,1.35]
[null,"MÃO DE OBRA (B) - TOTAL",null,null,null,null,null,null,1.89,2.19]
[null,"COTAÇÃO","COT 004_SEE","PRESILHA LATÃO 16/35MM 5MM+PARAF FENDA 1/4''X1.1/4''","UN ",1,1.5933333333333335,1.5933333333333335,1.59,1.59]
[null,"MATERIAL (C) - TOTAL",null,null,null,null,null,null,1.59,1.59]
[]
[37,"FONTE","CÓDIGO","DESCRIÇÃO","UNIDADE","COEFIC.","CUSTO UNITÁRIO",null,"CUSTO  TOTAL (A) + (B) + (C) + (D) + (E)"]
[null,null,null,null,null,null,"DESONERADO","NÃO DESONER.","DESONERADO","NÃO DESONER."]
[null,"COMPOSIÇÃO","COMP 037_SEE","CAIXA DE INSPEÇÃO PVC 300X250MM+TP P/CX INSP GALV FOGO 300MM","UN ",null,null,null,45.41,48.57]
[null,"AGETOP_I",8,"AJUDANTE","h     ",0.88,8.75,10.14,7.7,8.92]
[null,"AGETOP_I",12,"ELETRICISTA","h     ",0.88,13.95,16.16,12.28,14.22]
[null,"MÃO DE OBRA (B) - TOTAL",null,null,null,null,null,null,19.98,23.14]
[null,"COTAÇÃO","COT 005_SEE","CAIXA DE INSPEÇÃO PVC 300x250mm","UN ",1,18.3,18.3,18.3,18.3]
[null,"COTAÇÃO","COT 006_SEE","TAMPA PARA CAIXA DE INSPEÇÃO - GALVANIZADA FOGO 300 mm","UN ",1,7.13,7.13,7.13,7.13]
[null,"MATERIAL (C) - TOTAL",null,null,null,null,null,null,25.43,25.43]
[]
[382,"FONTE","CÓDIGO","DESCRIÇÃO","UNIDADE","COEFIC.","CUSTO UNITÁRIO",null,"CUSTO  TOTAL (A) + (B) + (C) + (D) + (E)"]
[null,null,null,null,null,null,"DESONERADO","NÃO DESONER.","DESONERADO","NÃO DESONER."]
[null,"COMPOSIÇÃO","COMP 382_SEE","TE DE REDUCAO DE FERRO GALVANIZADO, COM ROSCA BSP, DE 3/4\" X 1/2\"","UN ",null,null,null,22.58,24.759999999999998]
[null,"AGETOP_I",8,"AJUDANTE","h     ",0.6,8.75,10.14,5.25,6.08]
[null,"AGETOP_I",11,"ENCANADOR","h     ",0.61050000000000004,13.95,16.16,8.52,9.8699999999999992]
[null,"MÃO DE OBRA (B) - TOTAL",null,null,null,null,null,null,13.77,15.95]
[null,"SINAPI_I",3146,"FITA VEDA ROSCA EM ROLOS DE 18 MM X 10 M (L X C)","UN    ",0.12075471698113208,3.69,3.69,0.45,0.45]
[null,"SINAPI_I",6302,"TE DE REDUCAO DE FERRO GALVANIZADO, COM ROSCA BSP, DE 3/4\" X 1/2\"","UN    ",1,8.36,8.36,8.36,8.36]
[null,"MATERIAL (C) - TOTAL",null,null,null,null,null,null,8.8099999999999987,8.8099999999999987]
[]
[383,"FONTE","CÓDIGO","DESCRIÇÃO","UNIDADE","COEFIC.","CUSTO UNITÁRIO",null,"CUSTO  TOTAL (A) + (B) + (C) + (D) + (E)"]
[null,null,null,null,null,null,"DESONERADO","NÃO DESONER.","DESONERADO","NÃO DESONER."]
[null,"COMPOSIÇÃO","COMP 383_SEE","BUCHA DE REDUCAO DE FERRO GALVANIZADO, COM ROSCA BSP, DE 1/2\" X 1/4\"","UN ",null,null,null,6.71,7.29]
[null,"AGETOP_I",8,"AJUDANTE","h     ",0.16,8.75,10.14,1.4,1.62]
[null,"AGETOP_I",11,"ENCANADOR","h     ",0.16,13.95,16.16,2.23,2.59]
[null,"MÃO DE OBRA (B) - TOTAL",null,null,null,null,null,null,3.63,4.21]
[null,"AGETOP_I","H689","","",1.2,0,0,0,0]
[null,"SINAPI_I",770,"BUCHA DE REDUCAO DE FERRO GALVANIZADO, COM ROSCA BSP, DE 1/2\" X 1/4\"","UN    ",1,3.08,3.08,3.08,3.08]
[null,"MATERIAL (C) - TOTAL",null,null,null,null,null,null,3.08,3.08]
[]
[212,"FONTE","CÓDIGO","DESCRIÇÃO","UNIDADE","COEFIC.","CUSTO UNITÁRIO",null,"CUSTO  TOTAL (A) + (B) + (C) + (D) + (E)"]
[null,null,null,null,null,null,"DESONERADO","NÃO DESONER.","DESONERADO","NÃO DESONER."]
[null,"COMPOSIÇÃO","COMP 212_SEE","NIPLE DE REDUÇÃO 1/2\" X 1/4\" BSP","UN ",null,null,null,9.68,10.26]
[null,"AGETOP_I",8,"AJUDANTE","h     ",0.16,8.75,10.14,1.4,1.62]
[null,"AGETOP_I",11,"ENCANADOR","h     ",0.16,13.95,16.16,2.23,2.59]
[null,"MÃO DE OBRA (B) - TOTAL",null,null,null,null,null,null,3.63,4.21]
[null,"COTAÇÃO","COT 103_SEE","NIPLE DE REDUÇÃO 1/2\" X 1/4\" BSP","UN",1,6.0533333333333337,6.0533333333333337,6.05,6.05]
[null,"MATERIAL (C) - TOTAL",null,null,null,null,null,null,6.05,6.05]
[]
[213,"FONTE","CÓDIGO","DESCRIÇÃO","UNIDADE","COEFIC.","CUSTO UNITÁRIO",null,"CUSTO  TOTAL (A) + (B) + (C) + (D) + (E)"]
[null,null,null,null,null,null,"DESONERADO","NÃO DESONER.","DESONERADO","NÃO DESONER."]
[null,"COMPOSIÇÃO","COMP 213_SEE","NIPLE DE REDUÇÃO 3/4\" X 1/2\" BSP","UN ",null,null,null,13.34,13.920000000000002]
[null,"AGETOP_I",8,"AJUDANTE","h     ",0.16,8.75,10.14,1.4,1.62]
[null,"AGETOP_I",11,"ENCANADOR","h     ",0.16,13.95,16.16,2.23,2.59]
[null,"MÃO DE OBRA (B) - TOTAL",null,null,null,null,null,null,3.63,4.21]
[null,"COTAÇÃO","COT 104_SEE","NIPLE DE REDUÇÃO 3/4\" X 1/2\" BSP","UN",1,9.7099999999999991,9.7099999999999991,9.7100000000000009,9.7100000000000009]
[null,"MATERIAL (C) - TOTAL",null,null,null,null,null,null,9.7100000000000009,9.7100000000000009]
[]
[237,"FONTE","CÓDIGO","DESCRIÇÃO","UNIDADE","COEFIC.","CUSTO UNITÁRIO",null,"CUSTO  TOTAL (A) + (B) + (C) + (D) + (E)"]
[null,null,null,null,null,null,"DESONERADO","NÃO DESONER.","DESONERADO","NÃO DESONER."]
[null,"COMPOSIÇÃO","COMP 237_SEE","FITA ANTICORROSIVA","M",null,null,null,11.73,12.45]
[null,"AGETOP_I",8,"AJUDANTE","h     ",0.2,8.75,10.14,1.75,2.0299999999999998]
[null,"AGETOP_I",12,"ELETRICISTA","h     ",0.2,13.95,16.16,2.79,3.23]
[null,"MÃO DE OBRA (B) - TOTAL",null,null,null,null,null,null,4.54,5.26]
[null,"SINAPI_I",39634,"FITA ADESIVA ANTICORROSIVA DE PVC FLEXIVEL, COR PRETA, PARA PROTECAO TUBULACAO, 50 MM X 30 M (L X C), E= *0,25* MM","M     ",1,7.19,7.19,7.19,7.19]
[null,"MATERIAL (C) - TOTAL",null,null,null,null,null,null,7.19,7.19]
[]
[210,"FONTE","CÓDIGO","DESCRIÇÃO","UNIDADE","COEFIC.","CUSTO UNITÁRIO",null,"CUSTO  TOTAL (A) + (B) + (C) + (D) + (E)"]
[null,null,null,null,null,null,"DESONERADO","NÃO DESONER.","DESONERADO","NÃO DESONER."]
[null,"COMPOSIÇÃO","COMP 210_SEE","REGULADOR DE 1º ESTÁGIO 60KG/H MODELO AP-40  COM MANÔMETRO","UN ",null,null,null,231.68,235.82000000000002]
[null,"AGETOP_I",8,"AJUDANTE","h     ",1.1499999999999999,8.75,10.14,10.06,11.66]
[null,"AGETOP_I",11,"ENCANADOR","h     ",1.1499999999999999,13.95,16.16,16.04,18.579999999999998]
[null,"MÃO DE OBRA (B) - TOTAL",null,null,null,null,null,null,26.1,30.24]
[null,"COTAÇÃO","COT 101_SEE","REGULADOR DE 1º ESTÁGIO 60KG/H MODELO AP-40  COM MANÔMETRO","UN",1,205.57666666666668,205.57666666666668,205.58,205.58]
[null,"AGETOP_I","H689","","",2.82,0,0,0,0]
[null,"MATERIAL (C) - TOTAL",null,null,null,null,null,null,205.58,205.58]
[]
[235,"FONTE","CÓDIGO","DESCRIÇÃO","UNIDADE","COEFIC.","CUSTO UNITÁRIO",null,"CUSTO  TOTAL (A) + (B) + (C) + (D) + (E)"]
[null,null,null,null,null,null,"DESONERADO","NÃO DESONER.","DESONERADO","NÃO DESONER."]
[null,"COMPOSIÇÃO","COMP 235_SEE","PLACA DE SINALIZAÇÃO EM PVC COD 01 - (300X300) PROIBIDO FUMAR","UN ",null,null,null,24.159999999999997,24.279999999999998]
[null,"AGETOP_I",5,"SERVENTE","h     ",0.09,8.75,10.14,0.79,0.91]
[null,"MÃO DE OBRA (B) - TOTAL",null,null,null,null,null,null,0.79,0.91]
[null,"AGETOP_I",3070,"BUCHA DE NYLON S-6","un",2,0.04,0.04,0.08,0.08]
[null,"AGETOP_I",3393,"PARAFUSO P/BUCHA S-6","un",2,0.08,0.08,0.16,0.16]
[null,"SINAPI_I",37556,"PLACA DE SINALIZACAO DE SEGURANCA CONTRA INCENDIO, FOTOLUMINESCENTE, QUADRADA, *20 X 20* CM, EM PVC *2* MM ANTI-CHAMAS (SIMBOLOS, CORES E PICTOGRAMAS CONFORME NBR 13434)","UN    ",1,23.13,23.13,23.13,23.13]
[null,"MATERIAL (C) - TOTAL",null,null,null,null,null,null,23.369999999999997,23.369999999999997]
[]
[236,"FONTE","CÓDIGO","DESCRIÇÃO","UNIDADE","COEFIC.","CUSTO UNITÁRIO",null,"CUSTO  TOTAL (A) + (B) + (C) + (D) + (E)"]
[null,null,null,null,null,null,"DESONERADO","NÃO DESONER.","DESONERADO","NÃO DESONER."]
[null,"COMPOSIÇÃO","COMP 236_SEE","PLACA DE SINALIZAÇÃO EM PVC COD 06 - (300X300) PERIGO INFLAMÁVEL","UN ",null,null,null,24.159999999999997,24.279999999999998]
[null,"AGETOP_I",5,"SERVENTE","h     ",0.09,8.75,10.14,0.79,0.91]
[null,"MÃO DE OBRA (B) - TOTAL",null,null,null,null,null,null,0.79,0.91]
[null,"AGETOP_I",3070,"BUCHA DE NYLON S-6","un",2,0.04,0.04,0.08,0.08]
[null,"AGETOP_I",3393,"PARAFUSO P/BUCHA S-6","un",2,0.08,0.08,0.16,0.16]
[null,"SINAPI_I",37556,"PLACA DE SINALIZACAO DE SEGURANCA CONTRA INCENDIO, FOTOLUMINESCENTE, QUADRADA, *20 X 20* CM, EM PVC *2* MM ANTI-CHAMAS (SIMBOLOS, CORES E PICTOGRAMAS CONFORME NBR 13434)","UN    ",1,23.13,23.13,23.13,23.13]
[null,"MATERIAL (C) - TOTAL",null,null,null,null,null,null,23.369999999999997,23.369999999999997]
[]
[45,"FONTE","CÓDIGO","DESCRIÇÃO","UNIDADE","COEFIC.","CUSTO UNITÁRIO",null,"CUSTO  TOTAL (A) + (B) + (C) + (D) + (E)"]
[null,null,null,null,null,null,"DESONERADO","NÃO DESONER.","DESONERADO","NÃO DESONER."]
[null,"COMPOSIÇÃO","COMP 045_SEE","LAUDO DE ESTANQUEIDADE","UN ",null,null,null,936,1085.1199999999999]
[null,"AGETOP",250101,"ENGENHEIRO - (OBRAS CIVIS)","H     ",16,58.5,67.819999999999993,936,1085.1199999999999]
[null,"MÃO DE OBRA (B) - TOTAL",null,null,null,null,null,null,936,1085.1199999999999]
[null,"MATERIAL (C) - TOTAL",null,null,null,null,null,null,0,0]
[]
[277,"FONTE","CÓDIGO","DESCRIÇÃO","UNIDADE","COEFIC.","CUSTO UNITÁRIO",null,"CUSTO  TOTAL (A) + (B) + (C) + (D) + (E)"]
[null,null,null,null,null,null,"DESONERADO","NÃO DESONER.","DESONERADO","NÃO DESONER."]
[null,"COMPOSIÇÃO","COMP 277_SEE","MARCAÇÃO NO PISO - 1X1 M PARA EXTINTOR","M2",null,null,null,29.07,29.14]
[null,"AGETOP_I",5,"SERVENTE","h     ",3.3300000000000003E-2,8.75,10.14,0.28999999999999998,0.34]
[null,"MÃO DE OBRA (B) - TOTAL",null,null,null,null,null,null,0.28999999999999998,0.34]
[null,"SINAPI_I",5318,"SOLVENTE DILUENTE A BASE DE AGUARRAS","L     ",0.13,10.86,10.86,1.41,1.41]
[null,"SINAPI",5824,"CAMINHÃO TOCO, PBT 16.000 KG, CARGA ÚTIL MÁX. 10.685 KG, DIST. ENTRE EIXOS 4,8 M, POTÊNCIA 189 CV, INCLUSIVE CARROCERIA FIXA ABERTA DE MADEIRA P/ TRANSPORTE GERAL DE CARGA SECA, DIMEN. APROX. 2,5 X 7,00 X 0,50 M - CHP DIURNO. AF_06/2014","CHP",3.3E-3,122.23,125.42,0.4,0.41]
[null,"SINAPI_I",7343,"TINTA A BASE DE RESINA ACRILICA, PARA SINALIZACAO HORIZONTAL VIARIA (NBR 11862)","L     ",0.6,12,12,7.2,7.2]
[null,"SINAPI_I",7348,"TINTA ACRILICA PREMIUM PARA PISO","L     ",0.03,13.81,13.81,0.41,0.41]
[null,"SINAPI_I",25972,"MICROESFERAS DE VIDRO PARA SINALIZACAO HORIZONTAL VIARIA, TIPO I-B (PREMIX) - NBR 16184","KG    ",2.14,8.8800000000000008,8.8800000000000008,19,19]
[null,"SINAPI",95133,"MÁQUINA DEMARCADORA DE FAIXA DE TRÁFEGO À FRIO, AUTOPROPELIDA, POTÊNCIA 38 HP - CHP DIURNO. AF_07/2016","CHP",3.3E-3,108.52,112.07,0.36,0.37]
[null,"MATERIAL (C) - TOTAL",null,null,null,null,null,null,28.78,28.8]
[]
[40,"FONTE","CÓDIGO","DESCRIÇÃO","UNIDADE","COEFIC.","CUSTO UNITÁRIO",null,"CUSTO  TOTAL (A) + (B) + (C) + (D) + (E)"]
[null,null,null,null,null,null,"DESONERADO","NÃO DESONER.","DESONERADO","NÃO DESONER."]
[null,"COMPOSIÇÃO","COMP 040_SEE","CONJUNTO MOTOR-BOMBA ELÉTRICA TRIFÁSICO 380/220 V PARA VZ= 24,33 M³/H, HM= 46,24 M POTÊNCIA= 7,5 CV","UN ",null,null,null,3974.27,4003.07]
[null,"AGETOP_I",8,"AJUDANTE","h     ",8,8.75,10.14,70,81.12]
[null,"AGETOP_I",11,"ENCANADOR","h     ",8,13.95,16.16,111.6,129.28]
[null,"MÃO DE OBRA (B) - TOTAL",null,null,null,null,null,null,181.6,210.4]
[null,"COTAÇÃO","COT 008_SEE","CONJUNTO MOTOR-BOMBA ELÉTRICA TRIFÁSICO 380/220 V PARA VZ= 24,33 M³/H, HM= 46,24 M POTÊNCIA= 7,5 CV","UN ",1,3792.6666666666665,3792.6666666666665,3792.67,3792.67]
[null,"MATERIAL (C) - TOTAL",null,null,null,null,null,null,3792.67,3792.67]
[]
[78,"FONTE","CÓDIGO","DESCRIÇÃO","UNIDADE","COEFIC.","CUSTO UNITÁRIO",null,"CUSTO  TOTAL (A) + (B) + (C) + (D) + (E)"]
[null,null,null,null,null,null,"DESONERADO","NÃO DESONER.","DESONERADO","NÃO DESONER."]
[null,"COMPOSIÇÃO","COMP 078_SEE","TAMPÃO CEGO COM CORRENTE 1 1/2\"","UN ",null,null,null,61.3,61.91]
[null,"AGETOP_I",11,"ENCANADOR","h     ",0.28000000000000003,13.95,16.16,3.91,4.5199999999999996]
[null,"MÃO DE OBRA (B) - TOTAL",null,null,null,null,null,null,3.91,4.5199999999999996]
[null,"SINAPI_I",20964,"TAMPAO COM CORRENTE, EM LATAO, ENGATE RAPIDO 1 1/2\", PARA INSTALACAO PREDIAL DE COMBATE A INCENDIO","UN    ",1,57.39,57.39,57.39,57.39]
[null,"MATERIAL (C) - TOTAL",null,null,null,null,null,null,57.39,57.39]
[]
[17,"FONTE","CÓDIGO","DESCRIÇÃO","UNIDADE","COEFIC.","CUSTO UNITÁRIO",null,"CUSTO  TOTAL (A) + (B) + (C) + (D) + (E)"]
[null,null,null,null,null,null,"DESONERADO","NÃO DESONER.","DESONERADO","NÃO DESONER."]
[null,"COMPOSIÇÃO","COMP 017_SEE","REDUCAO GIRATÓRIA TIPO STORZ LATAO P/ INST. PREDIAL COMBATE A INCENDIO ENGATE RAPIDO 2.1/2\" X 1.1/2\"","UN ",null,"-","-",108.61999999999999,109.19999999999999]
[null,"AGETOP_I",8,"AJUDANTE","h     ",0.16,8.75,10.14,1.4,1.62]
[null,"AGETOP_I",11,"ENCANADOR","h     ",0.16,13.95,16.16,2.23,2.59]
[null,"MÃO DE OBRA (B) - TOTAL",null,null,null,null,null,null,3.63,4.21]
[null,"SINAPI_I",20972,"REDUCAO FIXA TIPO STORZ, ENGATE RAPIDO 2.1/2\" X 1.1/2\", EM LATAO, PARA INSTALACAO PREDIAL COMBATE A INCENDIO PREDIAL","UN    ",1,104.99,104.99,104.99,104.99]
[null,"MATERIAL (C) - TOTAL",null,null,null,null,null,null,104.99,104.99]
[]
[18,"FONTE","CÓDIGO","DESCRIÇÃO","UNIDADE","COEFIC.","CUSTO UNITÁRIO",null,"CUSTO  TOTAL (A) + (B) + (C) + (D) + (E)"]
[null,null,null,null,null,null,"DESONERADO","NÃO DESONER.","DESONERADO","NÃO DESONER."]
[null,"COMPOSIÇÃO","COMP 018_SEE","CHAVE DUPLA P/ CONEXÕES TIPO STORZ EM LATÃO ENGATE RÁPIDO 1 1/2\" X 2 1/2\"","UN ",null,"-","-",16.079999999999998,16.41]
[null,"AGETOP_I",11,"ENCANADOR","h     ",0.15,13.95,16.16,2.09,2.42]
[null,"MÃO DE OBRA (B) - TOTAL",null,null,null,null,null,null,2.09,2.42]
[null,"SINAPI_I",20971,"CHAVE DUPLA PARA CONEXOES TIPO STORZ, ENGATE RAPIDO 1 1/2\" X 2 1/2\", EM LATAO, PARA INSTALACAO PREDIAL COMBATE A INCENDIO","UN    ",1,13.99,13.99,13.99,13.99]
[null,"MATERIAL (C) - TOTAL",null,null,null,null,null,null,13.99,13.99]
[]
[87,"FONTE","CÓDIGO","DESCRIÇÃO","UNIDADE","COEFIC.","CUSTO UNITÁRIO",null,"CUSTO  TOTAL (A) + (B) + (C) + (D) + (E)"]
[null,null,null,null,null,null,"DESONERADO","NÃO DESONER.","DESONERADO","NÃO DESONER."]
[null,"COMPOSIÇÃO","COMP 087_SEE","REGISTRO DE GAVETA COM HASTE ASCENDENTE DE BRONZE 2 1/2\"","UN ",null,null,null,257.77,261.90999999999997]
[null,"AGETOP_I",8,"AJUDANTE","h     ",1.1499999999999999,8.75,10.14,10.06,11.66]
[null,"AGETOP_I",11,"ENCANADOR","h     ",1.1499999999999999,13.95,16.16,16.04,18.579999999999998]
[null,"MÃO DE OBRA (B) - TOTAL",null,null,null,null,null,null,26.1,30.24]
[null,"AGETOP_I","H689","","",2.82,0,0,0,0]
[null,"COTAÇÃO","COT 017_SEE","REGISTRO DE GAVETA COM HASTE ASCENDENTE DE BRONZE 2 1/2\"","UN ",1,231.66666666666666,231.66666666666666,231.67,231.67]
[null,"MATERIAL (C) - TOTAL",null,null,null,null,null,null,231.67,231.67]
[]
[30,"FONTE","CÓDIGO","DESCRIÇÃO","UNIDADE","COEFIC.","CUSTO UNITÁRIO",null,"CUSTO  TOTAL (A) + (B) + (C) + (D) + (E)"]
[null,null,null,null,null,null,"DESONERADO","NÃO DESONER.","DESONERADO","NÃO DESONER."]
[null,"COMPOSIÇÃO","COMP 030_SEE","COTOVELO DE FERRO GALV. 90° X 2 1/2\"","UN ",null,null,null,69.61,72.929999999999993]
[null,"AGETOP_I",8,"AJUDANTE","h     ",0.92,8.75,10.14,8.0500000000000007,9.33]
[null,"AGETOP_I",11,"ENCANADOR","h     ",0.92,13.95,16.16,12.83,14.87]
[null,"MÃO DE OBRA (B) - TOTAL",null,null,null,null,null,null,20.880000000000003,24.2]
[null,"SINAPI_I",3470,"COTOVELO 90 GRAUS DE FERRO GALVANIZADO, COM ROSCA BSP, DE 2 1/2\"","UN    ",1,48.73,48.73,48.73,48.73]
[null,"AGETOP_I","H689","","",2,0,0,0,0]
[null,"MATERIAL (C) - TOTAL",null,null,null,null,null,null,48.73,48.73]
[]
[77,"FONTE","CÓDIGO","DESCRIÇÃO","UNIDADE","COEFIC.","CUSTO UNITÁRIO",null,"CUSTO  TOTAL (A) + (B) + (C) + (D) + (E)"]
[null,null,null,null,null,null,"DESONERADO","NÃO DESONER.","DESONERADO","NÃO DESONER."]
[null,"COMPOSIÇÃO","COMP 077_SEE","UNIAO FERRO GALV C/ASSENTO CONICO BRONZE 2 1/2\"","UN ",null,null,null,148.07000000000002,149.51000000000002]
[null,"AGETOP_I",8,"AJUDANTE","h     ",0.4,8.75,10.14,3.5,4.0599999999999996]
[null,"AGETOP_I",11,"ENCANADOR","h     ",0.4,13.95,16.16,5.58,6.46]
[null,"MÃO DE OBRA (B) - TOTAL",null,null,null,null,null,null,9.08,10.52]
[null,"AGETOP_I","H689","","",2.4,0,0,0,0]
[null,"SINAPI_I",12427,"UNIAO COM ASSENTO CONICO DE BRONZE, DIAMETRO 2 1/2\"","UN    ",1,138.99,138.99,138.99,138.99]
[null,"MATERIAL (C) - TOTAL",null,null,null,null,null,null,138.99,138.99]
[]
[347,"FONTE","CÓDIGO","DESCRIÇÃO","UNIDADE","COEFIC.","CUSTO UNITÁRIO",null,"CUSTO  TOTAL (A) + (B) + (C) + (D) + (E)"]
[null,null,null,null,null,null,"DESONERADO","NÃO DESONER.","DESONERADO","NÃO DESONER."]
[null,"COMPOSIÇÃO","COMP 347_SEE","ADAPTADOR PVC SOLDAVEL, COM FLANGES LIVRES, 75 MM X 2 1/2\", PARA CAIXA D' AGUA","UN ",null,null,null,120.25,120.75]
[null,"AGETOP_I",11,"ENCANADOR","h     ",0.14000000000000001,13.95,16.16,1.95,2.2599999999999998]
[null,"AGETOP_I",8,"AJUDANTE","h     ",0.14000000000000001,8.75,10.14,1.23,1.42]
[null,"MÃO DE OBRA (B) - TOTAL",null,null,null,null,null,null,3.1799999999999997,3.6799999999999997]
[null,"SINAPI_I",83,"ADAPTADOR PVC SOLDAVEL, COM FLANGES LIVRES, 75 MM X 2  1/2\", PARA CAIXA D' AGUA","UN    ",1,117.07,117.07,117.07,117.07]
[null,"AGETOP_I","H689","","",1.88,0,0,0,0]
[null,"MATERIAL (C) - TOTAL",null,null,null,null,null,null,117.07,117.07]
[]
[22,"FONTE","CÓDIGO","DESCRIÇÃO","UNIDADE","COEFIC.","CUSTO UNITÁRIO",null,"CUSTO  TOTAL (A) + (B) + (C) + (D) + (E)"]
[null,null,null,null,null,null,"DESONERADO","NÃO DESONER.","DESONERADO","NÃO DESONER."]
[null,"COMPOSIÇÃO","COMP 022_SEE","TAMPÃO FOFO 40X50CM C/INSCRIÇÃO ","UN ",null,"-","-",198.75,199.07999999999998]
[null,"AGETOP_I",11,"ENCANADOR","h     ",0.15,13.95,16.16,2.09,2.42]
[null,"MÃO DE OBRA (B) - TOTAL",null,null,null,null,null,null,2.09,2.42]
[null,"SINAPI_I",11293,"TAMPAO FOFO SIMPLES COM BASE, CLASSE A15 CARGA MAX 1,5 T, 400 X 500 MM, COM INSCRICAO INCENDIO","UN    ",1,196.66,196.66,196.66,196.66]
[null,"MATERIAL (C) - TOTAL",null,null,null,null,null,null,196.66,196.66]
[]
[546,"FONTE","CÓDIGO","DESCRIÇÃO","UNID ","COEFIC.","CUSTO UNITÁRIO",null,"CUSTO  TOTAL (A) + (B) + (C) + (D) + (E)"]
[null,null,null,null,null,null,"DESONERADO","NÃO DESONER.","DESONERADO","NÃO DESONER."]
[null,"COMPOSIÇÃO","COMP 546_SEE","BUJÃO DE REBORDO 2.1/2\"","UN ","-","-","-",16.59,16.84]
[null,"AGETOP_I",8,"AJUDANTE","h     ",7.0000000000000007E-2,8.75,10.14,0.61,0.71]
[null,"AGETOP_I",11,"ENCANADOR","h     ",7.0000000000000007E-2,13.95,16.16,0.98,1.1299999999999999]
[null,"MÃO DE OBRA (B) - TOTAL",null,null,null,null,null,null,1.5899999999999999,1.8399999999999999]
[null,"COTAÇÃO","COT 286_SEE","BUJÃO DE REBORDO 2.1/2\"","UN ",1,15,15,15,15]
[null,"MATERIAL (C) - TOTAL",null,null,null,null,null,null,15,15]
[]
[186,"FONTE","CÓDIGO","DESCRIÇÃO","UNIDADE","COEFIC.","CUSTO UNITÁRIO",null,"CUSTO  TOTAL (A) + (B) + (C) + (D) + (E)"]
[null,null,null,null,null,null,"DESONERADO","NÃO DESONER.","DESONERADO","NÃO DESONER."]
[null,"COMPOSIÇÃO","COMP 186_SEE","BOTOEIRA BOMBA DE INCÊNDIO C/ MARTELO CONVENCIONAL/ ANALÓGICA","UN ",null,null,null,86.2,89.8]
[null,"AGETOP_I",8,"AJUDANTE","h     ",1,8.75,10.14,8.75,10.14]
[null,"AGETOP_I",12,"ELETRICISTA","h     ",1,13.95,16.16,13.95,16.16]
[null,"MÃO DE OBRA (B) - TOTAL",null,null,null,null,null,null,22.7,26.3]
[null,"COTAÇÃO","COT 088_SEE","BOTOEIRA BOMBA DE INCÊNDIO C/ MARTELO CONVENCIONAL/ ANALÓGICA","UN",1,63.5,63.5,63.5,63.5]
[null,"MATERIAL (C) - TOTAL",null,null,null,null,null,null,63.5,63.5]
[]
[188,"FONTE","CÓDIGO","DESCRIÇÃO","UNIDADE","COEFIC.","CUSTO UNITÁRIO",null,"CUSTO  TOTAL (A) + (B) + (C) + (D) + (E)"]
[null,null,null,null,null,null,"DESONERADO","NÃO DESONER.","DESONERADO","NÃO DESONER."]
[null,"COMPOSIÇÃO","COMP 188_SEE","ACIONADOR MANUAL DE ALARME","UN ",null,null,null,101.49,104.37]
[null,"AGETOP_I",8,"AJUDANTE","h     ",0.8,8.75,10.14,7,8.11]
[null,"AGETOP_I",12,"ELETRICISTA","h     ",0.8,13.95,16.16,11.16,12.93]
[null,"MÃO DE OBRA (B) - TOTAL",null,null,null,null,null,null,18.16,21.04]
[null,"COTAÇÃO","COT 090_SEE","ACIONADOR MANUAL DE ALARME","UN",1,83.333333333333329,83.333333333333329,83.33,83.33]
[null,"MATERIAL (C) - TOTAL",null,null,null,null,null,null,83.33,83.33]
[]
[190,"FONTE","CÓDIGO","DESCRIÇÃO","UNIDADE","COEFIC.","CUSTO UNITÁRIO",null,"CUSTO  TOTAL (A) + (B) + (C) + (D) + (E)"]
[null,null,null,null,null,null,"DESONERADO","NÃO DESONER.","DESONERADO","NÃO DESONER."]
[null,"COMPOSIÇÃO","COMP 190_SEE","CENTRAL DE DETECÇÃO E ALARME DE 40 SETORES COM BATERIA","UN ",null,null,null,1144.93,1173.73]
[null,"AGETOP_I",8,"AJUDANTE","h     ",8,8.75,10.14,70,81.12]
[null,"AGETOP_I",12,"ELETRICISTA","h     ",8,13.95,16.16,111.6,129.28]
[null,"MÃO DE OBRA (B) - TOTAL",null,null,null,null,null,null,181.6,210.4]
[null,"COTAÇÃO","COT 092_SEE","CENTRAL DE DETECÇÃO E ALARME DE 40 SETORES COM BATERIA (PREÇO MÉDIO)","UN",1,963.33333333333337,963.33333333333337,963.33,963.33]
[null,"MATERIAL (C) - TOTAL",null,null,null,null,null,null,963.33,963.33]
[]
[24,"FONTE","CÓDIGO","DESCRIÇÃO","UNIDADE","COEFIC.","CUSTO UNITÁRIO",null,"CUSTO  TOTAL (A) + (B) + (C) + (D) + (E)"]
[null,null,null,null,null,null,"DESONERADO","NÃO DESONER.","DESONERADO","NÃO DESONER."]
[null,"COMPOSIÇÃO","COMP 024_SEE","SINALIZADOR FOTOLUMINESCENTE PARA EXTINTOR","UN ",null,"-","-",24.159999999999997,24.279999999999998]
[null,"AGETOP_I",5,"SERVENTE","h     ",0.09,8.75,10.14,0.79,0.91]
[null,"MÃO DE OBRA (B) - TOTAL",null,null,null,null,null,null,0.79,0.91]
[null,"AGETOP_I",3070,"BUCHA DE NYLON S-6","un",2,0.04,0.04,0.08,0.08]
[null,"AGETOP_I",3393,"PARAFUSO P/BUCHA S-6","un",2,0.08,0.08,0.16,0.16]
[null,"SINAPI_I",37556,"PLACA DE SINALIZACAO DE SEGURANCA CONTRA INCENDIO, FOTOLUMINESCENTE, QUADRADA, *20 X 20* CM, EM PVC *2* MM ANTI-CHAMAS (SIMBOLOS, CORES E PICTOGRAMAS CONFORME NBR 13434)","UN    ",1,23.13,23.13,23.13,23.13]
[null,"MATERIAL (C) - TOTAL",null,null,null,null,null,null,23.369999999999997,23.369999999999997]
[]
[25,"FONTE","CÓDIGO","DESCRIÇÃO","UNIDADE","COEFIC.","CUSTO UNITÁRIO",null,"CUSTO  TOTAL (A) + (B) + (C) + (D) + (E)"]
[null,null,null,null,null,null,"DESONERADO","NÃO DESONER.","DESONERADO","NÃO DESONER."]
[null,"COMPOSIÇÃO","COMP 025_SEE","SINALIZADOR FOTOLUMINESCENTE DE EMERGÊNCIA","UN ",null,"-","-",24.159999999999997,24.279999999999998]
[null,"AGETOP_I",5,"SERVENTE","h     ",0.09,8.75,10.14,0.79,0.91]
[null,"MÃO DE OBRA (B) - TOTAL",null,null,null,null,null,null,0.79,0.91]
[null,"AGETOP_I",3070,"BUCHA DE NYLON S-6","un",2,0.04,0.04,0.08,0.08]
[null,"AGETOP_I",3393,"PARAFUSO P/BUCHA S-6","un",2,0.08,0.08,0.16,0.16]
[null,"SINAPI_I",37556,"PLACA DE SINALIZACAO DE SEGURANCA CONTRA INCENDIO, FOTOLUMINESCENTE, QUADRADA, *20 X 20* CM, EM PVC *2* MM ANTI-CHAMAS (SIMBOLOS, CORES E PICTOGRAMAS CONFORME NBR 13434)","UN    ",1,23.13,23.13,23.13,23.13]
[null,"MATERIAL (C) - TOTAL",null,null,null,null,null,null,23.369999999999997,23.369999999999997]
[]
[277,"FONTE","CÓDIGO","DESCRIÇÃO","UNIDADE","COEFIC.","CUSTO UNITÁRIO",null,"CUSTO  TOTAL (A) + (B) + (C) + (D) + (E)"]
[null,null,null,null,null,null,"DESONERADO","NÃO DESONER.","DESONERADO","NÃO DESONER."]
[null,"COMPOSIÇÃO","COMP 277_SEE","MARCAÇÃO NO PISO - 1X1 M PARA EXTINTOR","M2",null,null,null,29.07,29.14]
[null,"AGETOP_I",5,"SERVENTE","h     ",3.3300000000000003E-2,8.75,10.14,0.28999999999999998,0.34]
[null,"MÃO DE OBRA (B) - TOTAL",null,null,null,null,null,null,0.28999999999999998,0.34]
[null,"SINAPI_I",5318,"SOLVENTE DILUENTE A BASE DE AGUARRAS","L     ",0.13,10.86,10.86,1.41,1.41]
[null,"SINAPI",5824,"CAMINHÃO TOCO, PBT 16.000 KG, CARGA ÚTIL MÁX. 10.685 KG, DIST. ENTRE EIXOS 4,8 M, POTÊNCIA 189 CV, INCLUSIVE CARROCERIA FIXA ABERTA DE MADEIRA P/ TRANSPORTE GERAL DE CARGA SECA, DIMEN. APROX. 2,5 X 7,00 X 0,50 M - CHP DIURNO. AF_06/2014","CHP",3.3E-3,122.23,125.42,0.4,0.41]
[null,"SINAPI_I",7343,"TINTA A BASE DE RESINA ACRILICA, PARA SINALIZACAO HORIZONTAL VIARIA (NBR 11862)","L     ",0.6,12,12,7.2,7.2]
[null,"SINAPI_I",7348,"TINTA ACRILICA PREMIUM PARA PISO","L     ",0.03,13.81,13.81,0.41,0.41]
[null,"SINAPI_I",25972,"MICROESFERAS DE VIDRO PARA SINALIZACAO HORIZONTAL VIARIA, TIPO I-B (PREMIX) - NBR 16184","KG    ",2.14,8.8800000000000008,8.8800000000000008,19,19]
[null,"SINAPI",95133,"MÁQUINA DEMARCADORA DE FAIXA DE TRÁFEGO À FRIO, AUTOPROPELIDA, POTÊNCIA 38 HP - CHP DIURNO. AF_07/2016","CHP",3.3E-3,108.52,112.07,0.36,0.37]
[null,"MATERIAL (C) - TOTAL",null,null,null,null,null,null,28.78,28.8]
[]
[235,"FONTE","CÓDIGO","DESCRIÇÃO","UNIDADE","COEFIC.","CUSTO UNITÁRIO",null,"CUSTO  TOTAL (A) + (B) + (C) + (D) + (E)"]
[null,null,null,null,null,null,"DESONERADO","NÃO DESONER.","DESONERADO","NÃO DESONER."]
[null,"COMPOSIÇÃO","COMP 235_SEE","PLACA DE SINALIZAÇÃO EM PVC COD 01 - (300X300) PROIBIDO FUMAR","UN ",null,null,null,24.159999999999997,24.279999999999998]
[null,"AGETOP_I",5,"SERVENTE","h     ",0.09,8.75,10.14,0.79,0.91]
[null,"MÃO DE OBRA (B) - TOTAL",null,null,null,null,null,null,0.79,0.91]
[null,"AGETOP_I",3070,"BUCHA DE NYLON S-6","un",2,0.04,0.04,0.08,0.08]
[null,"AGETOP_I",3393,"PARAFUSO P/BUCHA S-6","un",2,0.08,0.08,0.16,0.16]
[null,"SINAPI_I",37556,"PLACA DE SINALIZACAO DE SEGURANCA CONTRA INCENDIO, FOTOLUMINESCENTE, QUADRADA, *20 X 20* CM, EM PVC *2* MM ANTI-CHAMAS (SIMBOLOS, CORES E PICTOGRAMAS CONFORME NBR 13434)","UN    ",1,23.13,23.13,23.13,23.13]
[null,"MATERIAL (C) - TOTAL",null,null,null,null,null,null,23.369999999999997,23.369999999999997]
[]
[236,"FONTE","CÓDIGO","DESCRIÇÃO","UNIDADE","COEFIC.","CUSTO UNITÁRIO",null,"CUSTO  TOTAL (A) + (B) + (C) + (D) + (E)"]
[null,null,null,null,null,null,"DESONERADO","NÃO DESONER.","DESONERADO","NÃO DESONER."]
[null,"COMPOSIÇÃO","COMP 236_SEE","PLACA DE SINALIZAÇÃO EM PVC COD 06 - (300X300) PERIGO INFLAMÁVEL","UN ",null,null,null,24.159999999999997,24.279999999999998]
[null,"AGETOP_I",5,"SERVENTE","h     ",0.09,8.75,10.14,0.79,0.91]
[null,"MÃO DE OBRA (B) - TOTAL",null,null,null,null,null,null,0.79,0.91]
[null,"AGETOP_I",3070,"BUCHA DE NYLON S-6","un",2,0.04,0.04,0.08,0.08]
[null,"AGETOP_I",3393,"PARAFUSO P/BUCHA S-6","un",2,0.08,0.08,0.16,0.16]
[null,"SINAPI_I",37556,"PLACA DE SINALIZACAO DE SEGURANCA CONTRA INCENDIO, FOTOLUMINESCENTE, QUADRADA, *20 X 20* CM, EM PVC *2* MM ANTI-CHAMAS (SIMBOLOS, CORES E PICTOGRAMAS CONFORME NBR 13434)","UN    ",1,23.13,23.13,23.13,23.13]
[null,"MATERIAL (C) - TOTAL",null,null,null,null,null,null,23.369999999999997,23.369999999999997]
[]
[411,"FONTE","CÓDIGO","DESCRIÇÃO","UNIDADE","COEFIC.","CUSTO UNITÁRIO",null,"CUSTO  TOTAL (A) + (B) + (C) + (D) + (E)"]
[null,null,null,null,null,null,"DESONERADO","NÃO DESONER.","DESONERADO","NÃO DESONER."]
[null,"COMPOSIÇÃO","COMP 411_SEE","PLACA DE SINALIZAÇÃO EM PVC COD 13 - (316X158) SAÍDA DE EMERGÊNCIA","UN ",null,null,null,29.4,29.52]
[null,"AGETOP_I",5,"SERVENTE","h     ",0.09,8.75,10.14,0.79,0.91]
[null,"MÃO DE OBRA (B) - TOTAL",null,null,null,null,null,null,0.79,0.91]
[null,"AGETOP_I",3070,"BUCHA DE NYLON S-6","un",2,0.04,0.04,0.08,0.08]
[null,"AGETOP_I",3393,"PARAFUSO P/BUCHA S-6","un",2,0.08,0.08,0.16,0.16]
[null,"SINAPI_I",37559,"PLACA DE SINALIZACAO DE SEGURANCA CONTRA INCENDIO, FOTOLUMINESCENTE, RETANGULAR, *12 X 40* CM, EM PVC *2* MM ANTI-CHAMAS (SIMBOLOS, CORES E PICTOGRAMAS CONFORME NBR 13434)","UN    ",1,28.37,28.37,28.37,28.37]
[null,"MATERIAL (C) - TOTAL",null,null,null,null,null,null,28.61,28.61]
[]
[412,"FONTE","CÓDIGO","DESCRIÇÃO","UNIDADE","COEFIC.","CUSTO UNITÁRIO",null,"CUSTO  TOTAL (A) + (B) + (C) + (D) + (E)"]
[null,null,null,null,null,null,"DESONERADO","NÃO DESONER.","DESONERADO","NÃO DESONER."]
[null,"COMPOSIÇÃO","COMP 412_SEE","PLACA DE SINALIZAÇÃO EM PVC COD 17 - (316X158) MENSAGEM \"SAÍDA\"","UN ",null,null,null,29.4,29.52]
[null,"AGETOP_I",5,"SERVENTE","h     ",0.09,8.75,10.14,0.79,0.91]
[null,"MÃO DE OBRA (B) - TOTAL",null,null,null,null,null,null,0.79,0.91]
[null,"AGETOP_I",3070,"BUCHA DE NYLON S-6","un",2,0.04,0.04,0.08,0.08]
[null,"AGETOP_I",3393,"PARAFUSO P/BUCHA S-6","un",2,0.08,0.08,0.16,0.16]
[null,"SINAPI_I",37559,"PLACA DE SINALIZACAO DE SEGURANCA CONTRA INCENDIO, FOTOLUMINESCENTE, RETANGULAR, *12 X 40* CM, EM PVC *2* MM ANTI-CHAMAS (SIMBOLOS, CORES E PICTOGRAMAS CONFORME NBR 13434)","UN    ",1,28.37,28.37,28.37,28.37]
[null,"MATERIAL (C) - TOTAL",null,null,null,null,null,null,28.61,28.61]
[]
[387,"FONTE","CÓDIGO","DESCRIÇÃO","UNIDADE","COEFIC.","CUSTO UNITÁRIO",null,"CUSTO  TOTAL (A) + (B) + (C) + (D) + (E)"]
[null,null,null,null,null,null,"DESONERADO","NÃO DESONER.","DESONERADO","NÃO DESONER."]
[null,"COMPOSIÇÃO","COMP 387_SEE","LÂMPADA LED TUBULAR 18W ","UN ",null,null,null,22.3,22.35]
[null,"AGETOP_I",8,"AJUDANTE","h     ",1.4999999999999999E-2,8.75,10.14,0.13,0.15]
[null,"AGETOP_I",12,"ELETRICISTA","h     ",1.4999999999999999E-2,13.95,16.16,0.21,0.24]
[null,"MÃO DE OBRA (B) - TOTAL",null,null,null,null,null,null,0.33999999999999997,0.39]
[null,"COTAÇÃO","COT 195_SEE","LÂMPADA LED TUBULAR 18W ","UN",1,21.959999999999997,21.959999999999997,21.96,21.96]
[null,"MATERIAL (C) - TOTAL",null,null,null,null,null,null,21.96,21.96]
[]
[36,"FONTE","CÓDIGO","DESCRIÇÃO","UNIDADE","COEFIC.","CUSTO UNITÁRIO",null,"CUSTO  TOTAL (A) + (B) + (C) + (D) + (E)"]
[null,null,null,null,null,null,"DESONERADO","NÃO DESONER.","DESONERADO","NÃO DESONER."]
[null,"COMPOSIÇÃO","COMP 036_SEE","PRESILHA LATÃO 16/35MM 5MM+PARAF FENDA ","UN ",null,null,null,3.48,3.7800000000000002]
[null,"AGETOP_I",8,"AJUDANTE","h     ",8.3299999999999999E-2,8.75,10.14,0.73,0.84]
[null,"AGETOP_I",12,"ELETRICISTA","h     ",8.3299999999999999E-2,13.95,16.16,1.1599999999999999,1.35]
[null,"MÃO DE OBRA (B) - TOTAL",null,null,null,null,null,null,1.89,2.19]
[null,"COTAÇÃO","COT 004_SEE","PRESILHA LATÃO 16/35MM 5MM+PARAF FENDA 1/4''X1.1/4''","UN ",1,1.5933333333333335,1.5933333333333335,1.59,1.59]
[null,"MATERIAL (C) - TOTAL",null,null,null,null,null,null,1.59,1.59]
[]
[39,"FONTE","CÓDIGO","DESCRIÇÃO","UNIDADE","COEFIC.","CUSTO UNITÁRIO",null,"CUSTO  TOTAL (A) + (B) + (C) + (D) + (E)"]
[null,null,null,null,null,null,"DESONERADO","NÃO DESONER.","DESONERADO","NÃO DESONER."]
[null,"COMPOSIÇÃO","COMP 039_SEE","MOLDE GRAF CGT 5/8 50MM C","UN ",null,null,null,139.47,139.6]
[null,"AGETOP_I",8,"AJUDANTE","h     ",3.3300000000000003E-2,8.75,10.14,0.28999999999999998,0.34]
[null,"AGETOP_I",12,"ELETRICISTA","h     ",3.3300000000000003E-2,13.95,16.16,0.46,0.54]
[null,"MÃO DE OBRA (B) - TOTAL",null,null,null,null,null,null,0.75,0.88000000000000012]
[null,"COTAÇÃO","COT 007_SEE","MOLDE GRAF CGT 5/8 50MM C","UN",1,138.7175,138.7175,138.72,138.72]
[null,"MATERIAL (C) - TOTAL",null,null,null,null,null,null,138.72,138.72]
[]
[550,"FONTE","CÓDIGO","DESCRIÇÃO","UNID ","COEFIC.","CUSTO UNITÁRIO",null,"CUSTO  TOTAL (A) + (B) + (C) + (D) + (E)"]
[null,null,null,null,null,null,"DESONERADO","NÃO DESONER.","DESONERADO","NÃO DESONER."]
[null,"COMPOSIÇÃO","COMP 550_SEE","ALIC P/MOLDE C-84","UN ","-","-","-",88.22,88.35]
[null,"AGETOP_I",8,"AJUDANTE","h     ",3.3300000000000003E-2,8.75,10.14,0.28999999999999998,0.34]
[null,"AGETOP_I",12,"ELETRICISTA","h     ",3.3300000000000003E-2,13.95,16.16,0.46,0.54]
[null,"MÃO DE OBRA (B) - TOTAL",null,null,null,null,null,null,0.75,0.88000000000000012]
[null,"COTAÇÃO","COT 292_SEE","ALIC P/MOLDE C-84","UN ",1,87.465000000000003,87.465000000000003,87.47,87.47]
[null,"MATERIAL (C) - TOTAL",null,null,null,null,null,null,87.47,87.47]
[]
[48,"FONTE","CÓDIGO","DESCRIÇÃO","UNIDADE","COEFIC.","CUSTO UNITÁRIO",null,"CUSTO  TOTAL (A) + (B) + (C) + (D) + (E)"]
[null,null,null,null,null,null,"DESONERADO","NÃO DESONER.","DESONERADO","NÃO DESONER."]
[null,"COMPOSIÇÃO","COMP 048_SEE","HASTE ROSQUEADA \"TIRANTE\" 3/8\"","M",null,null,null,14.46,15.899999999999999]
[null,"AGETOP_I",8,"AJUDANTE","h     ",0.4,8.75,10.14,3.5,4.0599999999999996]
[null,"AGETOP_I",12,"ELETRICISTA","h     ",0.4,13.95,16.16,5.58,6.46]
[null,"MÃO DE OBRA (B) - TOTAL",null,null,null,null,null,null,9.08,10.52]
[null,"COTAÇÃO","COT 012_SEE","HASTE ROSQUEADA \"TIRANTE\" 3/8\"","M",1,5.3833333333333329,5.3833333333333329,5.38,5.38]
[null,"MATERIAL (C) - TOTAL",null,null,null,null,null,null,5.38,5.38]
[]
[24,"FONTE","CÓDIGO","DESCRIÇÃO","UNIDADE","COEFIC.","CUSTO UNITÁRIO",null,"CUSTO  TOTAL (A) + (B) + (C) + (D) + (E)"]
[null,null,null,null,null,null,"DESONERADO","NÃO DESONER.","DESONERADO","NÃO DESONER."]
[null,"COMPOSIÇÃO","COMP 024_SEE","SINALIZADOR FOTOLUMINESCENTE PARA EXTINTOR","UN ",null,"-","-",24.159999999999997,24.279999999999998]
[null,"AGETOP_I",5,"SERVENTE","h     ",0.09,8.75,10.14,0.79,0.91]
[null,"MÃO DE OBRA (B) - TOTAL",null,null,null,null,null,null,0.79,0.91]
[null,"AGETOP_I",3070,"BUCHA DE NYLON S-6","un",2,0.04,0.04,0.08,0.08]
[null,"AGETOP_I",3393,"PARAFUSO P/BUCHA S-6","un",2,0.08,0.08,0.16,0.16]
[null,"SINAPI_I",37556,"PLACA DE SINALIZACAO DE SEGURANCA CONTRA INCENDIO, FOTOLUMINESCENTE, QUADRADA, *20 X 20* CM, EM PVC *2* MM ANTI-CHAMAS (SIMBOLOS, CORES E PICTOGRAMAS CONFORME NBR 13434)","UN    ",1,23.13,23.13,23.13,23.13]
[null,"MATERIAL (C) - TOTAL",null,null,null,null,null,null,23.369999999999997,23.369999999999997]
[]
[25,"FONTE","CÓDIGO","DESCRIÇÃO","UNIDADE","COEFIC.","CUSTO UNITÁRIO",null,"CUSTO  TOTAL (A) + (B) + (C) + (D) + (E)"]
[null,null,null,null,null,null,"DESONERADO","NÃO DESONER.","DESONERADO","NÃO DESONER."]
[null,"COMPOSIÇÃO","COMP 025_SEE","SINALIZADOR FOTOLUMINESCENTE DE EMERGÊNCIA","UN ",null,"-","-",24.159999999999997,24.279999999999998]
[null,"AGETOP_I",5,"SERVENTE","h     ",0.09,8.75,10.14,0.79,0.91]
[null,"MÃO DE OBRA (B) - TOTAL",null,null,null,null,null,null,0.79,0.91]
[null,"AGETOP_I",3070,"BUCHA DE NYLON S-6","un",2,0.04,0.04,0.08,0.08]
[null,"AGETOP_I",3393,"PARAFUSO P/BUCHA S-6","un",2,0.08,0.08,0.16,0.16]
[null,"SINAPI_I",37556,"PLACA DE SINALIZACAO DE SEGURANCA CONTRA INCENDIO, FOTOLUMINESCENTE, QUADRADA, *20 X 20* CM, EM PVC *2* MM ANTI-CHAMAS (SIMBOLOS, CORES E PICTOGRAMAS CONFORME NBR 13434)","UN    ",1,23.13,23.13,23.13,23.13]
[null,"MATERIAL (C) - TOTAL",null,null,null,null,null,null,23.369999999999997,23.369999999999997]
[]
[277,"FONTE","CÓDIGO","DESCRIÇÃO","UNIDADE","COEFIC.","CUSTO UNITÁRIO",null,"CUSTO  TOTAL (A) + (B) + (C) + (D) + (E)"]
[null,null,null,null,null,null,"DESONERADO","NÃO DESONER.","DESONERADO","NÃO DESONER."]
[null,"COMPOSIÇÃO","COMP 277_SEE","MARCAÇÃO NO PISO - 1X1 M PARA EXTINTOR","M2",null,null,null,29.07,29.14]
[null,"AGETOP_I",5,"SERVENTE","h     ",3.3300000000000003E-2,8.75,10.14,0.28999999999999998,0.34]
[null,"MÃO DE OBRA (B) - TOTAL",null,null,null,null,null,null,0.28999999999999998,0.34]
[null,"SINAPI_I",5318,"SOLVENTE DILUENTE A BASE DE AGUARRAS","L     ",0.13,10.86,10.86,1.41,1.41]
[null,"SINAPI",5824,"CAMINHÃO TOCO, PBT 16.000 KG, CARGA ÚTIL MÁX. 10.685 KG, DIST. ENTRE EIXOS 4,8 M, POTÊNCIA 189 CV, INCLUSIVE CARROCERIA FIXA ABERTA DE MADEIRA P/ TRANSPORTE GERAL DE CARGA SECA, DIMEN. APROX. 2,5 X 7,00 X 0,50 M - CHP DIURNO. AF_06/2014","CHP",3.3E-3,122.23,125.42,0.4,0.41]
[null,"SINAPI_I",7343,"TINTA A BASE DE RESINA ACRILICA, PARA SINALIZACAO HORIZONTAL VIARIA (NBR 11862)","L     ",0.6,12,12,7.2,7.2]
[null,"SINAPI_I",7348,"TINTA ACRILICA PREMIUM PARA PISO","L     ",0.03,13.81,13.81,0.41,0.41]
[null,"SINAPI_I",25972,"MICROESFERAS DE VIDRO PARA SINALIZACAO HORIZONTAL VIARIA, TIPO I-B (PREMIX) - NBR 16184","KG    ",2.14,8.8800000000000008,8.8800000000000008,19,19]
[null,"SINAPI",95133,"MÁQUINA DEMARCADORA DE FAIXA DE TRÁFEGO À FRIO, AUTOPROPELIDA, POTÊNCIA 38 HP - CHP DIURNO. AF_07/2016","CHP",3.3E-3,108.52,112.07,0.36,0.37]
[null,"MATERIAL (C) - TOTAL",null,null,null,null,null,null,28.78,28.8]
[]
[412,"FONTE","CÓDIGO","DESCRIÇÃO","UNIDADE","COEFIC.","CUSTO UNITÁRIO",null,"CUSTO  TOTAL (A) + (B) + (C) + (D) + (E)"]
[null,null,null,null,null,null,"DESONERADO","NÃO DESONER.","DESONERADO","NÃO DESONER."]
[null,"COMPOSIÇÃO","COMP 412_SEE","PLACA DE SINALIZAÇÃO EM PVC COD 17 - (316X158) MENSAGEM \"SAÍDA\"","UN ",null,null,null,29.4,29.52]
[null,"AGETOP_I",5,"SERVENTE","h     ",0.09,8.75,10.14,0.79,0.91]
[null,"MÃO DE OBRA (B) - TOTAL",null,null,null,null,null,null,0.79,0.91]
[null,"AGETOP_I",3070,"BUCHA DE NYLON S-6","un",2,0.04,0.04,0.08,0.08]
[null,"AGETOP_I",3393,"PARAFUSO P/BUCHA S-6","un",2,0.08,0.08,0.16,0.16]
[null,"SINAPI_I",37559,"PLACA DE SINALIZACAO DE SEGURANCA CONTRA INCENDIO, FOTOLUMINESCENTE, RETANGULAR, *12 X 40* CM, EM PVC *2* MM ANTI-CHAMAS (SIMBOLOS, CORES E PICTOGRAMAS CONFORME NBR 13434)","UN    ",1,28.37,28.37,28.37,28.37]
[null,"MATERIAL (C) - TOTAL",null,null,null,null,null,null,28.61,28.61]